{"text_format":"1","workbook":"xlsx","n_sheets":3,"sheets":["Půjčovna ALEA","formulář půjčovna","formulář věci na bazén_V.V."],"not_rendered":{"charts":0,"images":9,"macros":1,"external_links":0,"defined_names":3,"comments":0,"pivot_tables":0},"unopened":[],"bounds":{"document_bytes":16777216,"sheet_cells":100000,"rows_first":2000,"rows_last":500,"rows_between":2000,"halvings":0,"cell_chars":16384,"cell_head_chars":4096},"cells_cut":0,"cells_raw":0,"read":"whole","date_system":"1900"}

{"sheet":"Půjčovna ALEA","index":0,"n_rows":64,"n_cols":15,"rows_kept":64,"cut":false,"hidden":false,"merged":[[6,0,6,4],[8,0,8,4],[37,0,37,2],[34,0,34,4],[35,0,35,3]]}
["ALEA Divers - centrum potápění"]
["Kamýcká 10/131, Praha 6 - Suchdol, CZ"]
["www.ALEADIVERS.cz; +420 602 522 355"]
[]
["Ceník platný od 1.9.2023"]
[]
["Ceník půjčovny potápěčské techniky"]
[]
["Potápěči s certifikátem",null,null,null,null,null,null,null,null,{"$f":"$C$13*J11/J13","v":1.2},null,null,{"$f":"$C$13*M11/M13","v":1.3333333333333333}]
[null,null,null,0.17,0.25]
["Položka","Kauce","1-3 dny","4-6 dnů","7 a více dnů",null,1,2,3,4,5,6,7,8,9]
["Lahev □15L, □12L, □10L, □7L, □5L",8000,120,{"$f":"CEILING(C12-C12*$D$10,1)","v":100},{"$f":"CEILING(C12-C12*$E$10,1)","v":90}]
["BCD Seaquest SPECTRUM 1 ",8000,120,100,90,null,{"$f":"$C13*G$11","v":120},240,360,{"$f":"$D13*J$11","v":400},500,600,{"$f":"$E13*M$11","v":630},720,810]
["BCD □Technisub Hexagon, □Seaquest ZUMA, □BCD s integr. Zátěží",12000,160,133,120,null,160,320,480,532,665,798,840,960,1080]
["BCD □Tecline Peanut / □Fly Ultra - vč. Nože a Kapes na zátěž",19000,200,166,150,null,200,400,600,664,830,996,1050,1200,1350]
["OBLEK □Scubapro,□Seacsub,□Aqualung 5mm (□short+□fullsuit) - za ks",6000,100,83,75,null,100,200,300,332,415,498,525,600,675]
["AUTOMATIKA □ Apeks MTX-RC, □ Tecline V2 ICE (1.,2.stupeň,octo,tlak)",30150,290,241,218,null,290,580,870,964,1205,1446,1526,1744,1962]
["AUTOMATIKA □Atomic Z2,□Aqualung LEGEND (1.,2.stupeň,octo,tlak)",21100,210,175,158,null,210,420,630,700,875,1050,1106,1264,1422]
["AUTOMATIKA □ Apeks ATX40 (1.,2.stupeň,octo,tlak)",14000,180,150,135,null,180,360,540,600,750,900,945,1080,1215]
["SVĚTLO - □FINNLIGHT,□D520,□Beta50W,□XENON - aku,□nabíječka",9500,150,125,113,null,150,300,450,500,625,750,791,904,1017]
["Zátěžový opasek",400,10,9,8,null,10,20,30,36,45,54,56,64,72]
["ZÁTĚŽ - Olověné závaží - ks kostek",200,8,7,6,null,8,16,24,28,35,42,42,48,54]
["Počítač Suunto ZOOP NOVO, Aqualung i330+USB nabíječka, VYPER",9000,130,108,98,null,130,260,390,432,540,648,686,784,882]
["□Kompas SUUNTO SK7, □Hloubkoměr (i v konzoli)",2000,50,42,38,null,50,100,150,168,210,252,266,304,342]
["Neoprenové botky BEUCHAT, BARE",1500,50,42,38,null,50,100,150,168,210,252,266,304,342]
["Ploutve ATOMIC SPLITFINS páskové",5000,80,67,60,null,80,160,240,268,335,402,420,480,540]
["□Plouvte bazénové BEUCHAT, TECHNISUB, □páskové TECHNISUB",1000,50,42,38,null,50,100,150,168,210,252,266,304,342]
["MASKA - Silikonová BARE, TECHNISUB…",1500,50,42,38,null,50,100,150,168,210,252,266,304,342]
["□Šnorchl, □ostatní rukavice, □ostatní botky",500,20,17,15,null,20,40,60,68,85,102,105,120,135]
["RUKAVICE - BARE Kevlar 5mm",1500,35,30,27,null,35,70,105,120,150,180,189,216,243]
["□Nůž, □Redukce DIN/INT, □Deco boje",1500,20,17,15,null,20,40,60,68,85,102,105,120,135]
["Bedna na výstroj - AKCE - půjčovné ZDARMA",500,0,0,0,null,0,0,0,0,0,0,0,0,0]
["Plnění lahví 1L (% EANx)",null,12]
[]
["Všechny ceny jsou v Kč a za jeden den půjčení. Nepočítáme den zapůjčení (mimo půjček na 1 den), počítají se dny do dne vrácení výstroje včetně."]
["Doprava výstroje na námi pořádané akce a kurzy (tam a zpět do půjčovny)",null,null,null,"1 Kč / Km"]
[]
["Přátelé, studenti ALEA Divers a členové Vodního klubu",null,null,"sleva",0.2]
[]
["Položka","Kauce","1-3 dny","4-6 dnů","7 a více dnů"]
[{"$f":"A12","v":"Lahev □15L, □12L, □10L, □7L, □5L"},0,{"$f":"C12-C12*$E$38","v":96},80,72]
["BCD Seaquest SPECTRUM 1 ",0,96,80,72]
["BCD □Technisub Hexagon, □Seaquest ZUMA, □BCD s integr. Zátěží",0,128,106.4,96]
["BCD □Tecline Peanut / □Fly Ultra - vč. Nože a Kapes na zátěž",0,160,132.80000000000001,120]
["OBLEK □Scubapro,□Seacsub,□Aqualung 5mm (□short+□fullsuit) - za ks",0,80,66.400000000000006,60]
["AUTOMATIKA □ Apeks MTX-RC, □ Tecline V2 ICE (1.,2.stupeň,octo,tlak)",0,232,192.8,174.4]
["AUTOMATIKA □Atomic Z2,□Aqualung LEGEND (1.,2.stupeň,octo,tlak)",0,168,140,126.4]
["AUTOMATIKA □ Apeks ATX40 (1.,2.stupeň,octo,tlak)",0,144,120,108]
["SVĚTLO - □FINNLIGHT,□D520,□Beta50W,□XENON - aku,□nabíječka",0,120,100,90.4]
["Zátěžový opasek",0,8,7.2,6.4]
["ZÁTĚŽ - Olověné závaží - ks kostek",0,6.4,5.6,4.8]
["Počítač Suunto ZOOP NOVO, Aqualung i330+USB nabíječka, VYPER",0,104,86.4,78.400000000000006]
["□Kompas SUUNTO SK7, □Hloubkoměr (i v konzoli)",0,40,33.6,30.4]
["Neoprenové botky BEUCHAT, BARE",0,40,33.6,30.4]
["Ploutve ATOMIC SPLITFINS páskové",0,64,53.6,48]
["□Plouvte bazénové BEUCHAT, TECHNISUB, □páskové TECHNISUB",0,40,33.6,30.4]
["MASKA - Silikonová BARE, TECHNISUB…",0,40,33.6,30.4]
["□Šnorchl, □ostatní rukavice, □ostatní botky",0,16,13.6,12]
["RUKAVICE - BARE Kevlar 5mm",0,28,24,21.6]
["□Nůž, □Redukce DIN/INT, □Deco boje",0,16,13.6,12]
["Bedna na výstroj - AKCE - půjčovné ZDARMA",0,0,0,0]
[{"$f":"A33","v":"Plnění lahví 1L (% EANx)"},null,{"$f":"C33-C33*$E$38","v":9.6}]
[]
["alea"]

{"sheet":"formulář půjčovna","index":1,"n_rows":83,"n_cols":10,"rows_kept":83,"cut":false,"hidden":false,"merged":[[1,0,1,5],[18,0,19,0],[18,4,19,4],[18,3,19,3],[5,0,5,9],[18,6,18,7],[18,5,19,5],[18,9,19,9],[18,8,19,8],[2,0,2,5],[3,0,3,5],[7,6,7,9],[8,6,8,9],[9,6,9,9],[10,6,10,9],[10,1,10,2],[81,4,81,8],[82,0,82,2],[82,3,82,9],[60,0,60,9],[67,0,67,9],[63,0,63,9],[65,0,65,9],[76,0,76,9],[73,0,73,9],[72,0,72,9],[71,0,71,9],[75,0,75,9],[61,0,61,9],[70,0,70,9],[66,0,66,9],[69,0,69,9],[9,1,9,2],[8,1,8,2],[7,1,7,2],[68,0,68,9],[41,1,41,2],[55,0,55,9],[51,7,51,8],[51,2,51,3],[45,7,45,8]]}
["FORM VERZE 09/2016"]
["ALEA Divers - centrum potápění"]
["Kamýcká 10/131, Praha 6 - Suchdol, CZ"]
["+420 602 522 355, info@aleadivers.cz, http://www.aleadivers.cz"]
[]
["Seznam zapůjčeného materiálu"]
[]
["Jméno:",null,null,null,null," Rodné číslo:"]
["Adresa:",null,null,null,null,"Č.OP / Pasu:"]
["Telefon:",null,null,null,null,"E-mail:"]
["Potápěčská kvalifikace:",null,null,null,null,"Místo potápění:"]
[]
["Půjčovné celkem:",{"$f":"J47","v":0}]
["Záloha:",{"$f":"SUM(I22:I35)","v":0},false]
[null,null,false]
["Přijal:"]
["Datum:",null,"Podpis: ",null,null,null,null,null,null,false]
[]
["Materiál",true,null,"Poznámky","Počet ks","Pořizovací cena 1 ks","Půjčovné den/ks",null,"Záloha","Celkem"]
[null,{"$f":"'Půjčovna ALEA'!A5","v":"Ceník platný od 1.9.2023"},null,null,null,null,"původní","po slevě"]
[{"$f":"IF($B$19,'Půjčovna ALEA'!A12,IF(E21=0,\"\",'Půjčovna ALEA'!A12))","v":"Lahev □15L, □12L, □10L, □7L, □5L"},null,null,null,null,{"$f":"IF($B$19,'Půjčovna ALEA'!B12,IF(E21=0,\"\",'Půjčovna ALEA'!B12))","v":8000},{"$f":"IF($B$19,'Půjčovna ALEA'!C12,IF(E21=0,\"\",'Půjčovna ALEA'!C12))","v":120},{"$f":"IF($B$19,IF($J$17,IF($C$53<4,'Půjčovna ALEA'!C12,IF($C$53<7,'Půjčovna ALEA'!D12,IF($C$53>6,'Půjčovna ALEA'!E12)))*(1-'Půjčovna ALEA'!$E$38),IF($C$53<4,'Půjčovna ALEA'!C12,IF($C$53<7,'Půjčovna ALEA'!D12,IF($C$53>6,'Půjčovna ALEA'!E12)))),IF(E21>0,IF($J$17,IF($C$53<4,'Půjčovna ALEA'!C12,IF($C$53<7,'Půjčovna ALEA'!D12,IF($C$53>6,'Půjčovna ALEA'!E12)))*(1-'Půjčovna ALEA'!$E$38),IF($C$53<4,'Půjčovna ALEA'!C12,IF($C$53<7,'Půjčovna ALEA'!D12,IF($C$53>6,'Půjčovna ALEA'!E12)))),0))","v":120},{"$f":"IF($C$14,IF(E21>0,'Půjčovna ALEA'!B12*E21,),IF($C$15,IF(E21>0,'Půjčovna ALEA'!B12/2*E21,),))","v":0},{"$f":"I21+H21*E21*$C$53","v":0}]
[{"$f":"IF($B$19,'Půjčovna ALEA'!A13,IF(E22=0,\"\",'Půjčovna ALEA'!A13))","v":"BCD Seaquest SPECTRUM 1 "},null,null,null,null,{"$f":"IF($B$19,'Půjčovna ALEA'!B13,IF(E22=0,\"\",'Půjčovna ALEA'!B13))","v":8000},{"$f":"IF($B$19,'Půjčovna ALEA'!C13,IF(E22=0,\"\",'Půjčovna ALEA'!C13))","v":120},{"$f":"IF($B$19,IF($J$17,IF($C$53<4,'Půjčovna ALEA'!C13,IF($C$53<7,'Půjčovna ALEA'!D13,IF($C$53>6,'Půjčovna ALEA'!E13)))*(1-'Půjčovna ALEA'!$E$38),IF($C$53<4,'Půjčovna ALEA'!C13,IF($C$53<7,'Půjčovna ALEA'!D13,IF($C$53>6,'Půjčovna ALEA'!E13)))),IF(E22>0,IF($J$17,IF($C$53<4,'Půjčovna ALEA'!C13,IF($C$53<7,'Půjčovna ALEA'!D13,IF($C$53>6,'Půjčovna ALEA'!E13)))*(1-'Půjčovna ALEA'!$E$38),IF($C$53<4,'Půjčovna ALEA'!C13,IF($C$53<7,'Půjčovna ALEA'!D13,IF($C$53>6,'Půjčovna ALEA'!E13)))),0))","v":120},{"$f":"IF($C$14,IF(E22>0,'Půjčovna ALEA'!B13*E22,),IF($C$15,IF(E22>0,'Půjčovna ALEA'!B13/2*E22,),))","v":0},{"$f":"I22+H22*E22*$C$53","v":0}]
[{"$f":"IF($B$19,'Půjčovna ALEA'!A14,IF(E23=0,\"\",'Půjčovna ALEA'!A14))","v":"BCD □Technisub Hexagon, □Seaquest ZUMA, □BCD s integr. Zátěží"},null,null,null,null,{"$f":"IF($B$19,'Půjčovna ALEA'!B14,IF(E23=0,\"\",'Půjčovna ALEA'!B14))","v":12000},{"$f":"IF($B$19,'Půjčovna ALEA'!C14,IF(E23=0,\"\",'Půjčovna ALEA'!C14))","v":160},{"$f":"IF($B$19,IF($J$17,IF($C$53<4,'Půjčovna ALEA'!C14,IF($C$53<7,'Půjčovna ALEA'!D14,IF($C$53>6,'Půjčovna ALEA'!E14)))*(1-'Půjčovna ALEA'!$E$38),IF($C$53<4,'Půjčovna ALEA'!C14,IF($C$53<7,'Půjčovna ALEA'!D14,IF($C$53>6,'Půjčovna ALEA'!E14)))),IF(E23>0,IF($J$17,IF($C$53<4,'Půjčovna ALEA'!C14,IF($C$53<7,'Půjčovna ALEA'!D14,IF($C$53>6,'Půjčovna ALEA'!E14)))*(1-'Půjčovna ALEA'!$E$38),IF($C$53<4,'Půjčovna ALEA'!C14,IF($C$53<7,'Půjčovna ALEA'!D14,IF($C$53>6,'Půjčovna ALEA'!E14)))),0))","v":160},{"$f":"IF($C$14,IF(E23>0,'Půjčovna ALEA'!B14*E23,),IF($C$15,IF(E23>0,'Půjčovna ALEA'!B14/2*E23,),))","v":0},0]
[{"$f":"IF($B$19,'Půjčovna ALEA'!A15,IF(E24=0,\"\",'Půjčovna ALEA'!A15))","v":"BCD □Tecline Peanut / □Fly Ultra - vč. Nože a Kapes na zátěž"},null,null,null,null,{"$f":"IF($B$19,'Půjčovna ALEA'!B15,IF(E24=0,\"\",'Půjčovna ALEA'!B15))","v":19000},{"$f":"IF($B$19,'Půjčovna ALEA'!C15,IF(E24=0,\"\",'Půjčovna ALEA'!C15))","v":200},{"$f":"IF($B$19,IF($J$17,IF($C$53<4,'Půjčovna ALEA'!C15,IF($C$53<7,'Půjčovna ALEA'!D15,IF($C$53>6,'Půjčovna ALEA'!E15)))*(1-'Půjčovna ALEA'!$E$38),IF($C$53<4,'Půjčovna ALEA'!C15,IF($C$53<7,'Půjčovna ALEA'!D15,IF($C$53>6,'Půjčovna ALEA'!E15)))),IF(E24>0,IF($J$17,IF($C$53<4,'Půjčovna ALEA'!C15,IF($C$53<7,'Půjčovna ALEA'!D15,IF($C$53>6,'Půjčovna ALEA'!E15)))*(1-'Půjčovna ALEA'!$E$38),IF($C$53<4,'Půjčovna ALEA'!C15,IF($C$53<7,'Půjčovna ALEA'!D15,IF($C$53>6,'Půjčovna ALEA'!E15)))),0))","v":200},{"$f":"IF($C$14,IF(E24>0,'Půjčovna ALEA'!B15*E24,),IF($C$15,IF(E24>0,'Půjčovna ALEA'!B15/2*E24,),))","v":0},0]
[{"$f":"IF($B$19,'Půjčovna ALEA'!A16,IF(E25=0,\"\",'Půjčovna ALEA'!A16))","v":"OBLEK □Scubapro,□Seacsub,□Aqualung 5mm (□short+□fullsuit) - za ks"},null,null,null,null,{"$f":"IF($B$19,'Půjčovna ALEA'!B16,IF(E25=0,\"\",'Půjčovna ALEA'!B16))","v":6000},{"$f":"IF($B$19,'Půjčovna ALEA'!C16,IF(E25=0,\"\",'Půjčovna ALEA'!C16))","v":100},{"$f":"IF($B$19,IF($J$17,IF($C$53<4,'Půjčovna ALEA'!C16,IF($C$53<7,'Půjčovna ALEA'!D16,IF($C$53>6,'Půjčovna ALEA'!E16)))*(1-'Půjčovna ALEA'!$E$38),IF($C$53<4,'Půjčovna ALEA'!C16,IF($C$53<7,'Půjčovna ALEA'!D16,IF($C$53>6,'Půjčovna ALEA'!E16)))),IF(E25>0,IF($J$17,IF($C$53<4,'Půjčovna ALEA'!C16,IF($C$53<7,'Půjčovna ALEA'!D16,IF($C$53>6,'Půjčovna ALEA'!E16)))*(1-'Půjčovna ALEA'!$E$38),IF($C$53<4,'Půjčovna ALEA'!C16,IF($C$53<7,'Půjčovna ALEA'!D16,IF($C$53>6,'Půjčovna ALEA'!E16)))),0))","v":100},{"$f":"IF($C$14,IF(E25>0,'Půjčovna ALEA'!B16*E25,),IF($C$15,IF(E25>0,'Půjčovna ALEA'!B16/2*E25,),))","v":0},0]
[{"$f":"IF($B$19,'Půjčovna ALEA'!A17,IF(E26=0,\"\",'Půjčovna ALEA'!A17))","v":"AUTOMATIKA □ Apeks MTX-RC, □ Tecline V2 ICE (1.,2.stupeň,octo,tlak)"},null,null,null,null,{"$f":"IF($B$19,'Půjčovna ALEA'!B17,IF(E26=0,\"\",'Půjčovna ALEA'!B17))","v":30150},{"$f":"IF($B$19,'Půjčovna ALEA'!C17,IF(E26=0,\"\",'Půjčovna ALEA'!C17))","v":290},{"$f":"IF($B$19,IF($J$17,IF($C$53<4,'Půjčovna ALEA'!C17,IF($C$53<7,'Půjčovna ALEA'!D17,IF($C$53>6,'Půjčovna ALEA'!E17)))*(1-'Půjčovna ALEA'!$E$38),IF($C$53<4,'Půjčovna ALEA'!C17,IF($C$53<7,'Půjčovna ALEA'!D17,IF($C$53>6,'Půjčovna ALEA'!E17)))),IF(E26>0,IF($J$17,IF($C$53<4,'Půjčovna ALEA'!C17,IF($C$53<7,'Půjčovna ALEA'!D17,IF($C$53>6,'Půjčovna ALEA'!E17)))*(1-'Půjčovna ALEA'!$E$38),IF($C$53<4,'Půjčovna ALEA'!C17,IF($C$53<7,'Půjčovna ALEA'!D17,IF($C$53>6,'Půjčovna ALEA'!E17)))),0))","v":290},{"$f":"IF($C$14,IF(E26>0,'Půjčovna ALEA'!B17*E26,),IF($C$15,IF(E26>0,'Půjčovna ALEA'!B17/2*E26,),))","v":0},0]
[{"$f":"IF($B$19,'Půjčovna ALEA'!A18,IF(E27=0,\"\",'Půjčovna ALEA'!A18))","v":"AUTOMATIKA □Atomic Z2,□Aqualung LEGEND (1.,2.stupeň,octo,tlak)"},null,null,null,null,{"$f":"IF($B$19,'Půjčovna ALEA'!B18,IF(E27=0,\"\",'Půjčovna ALEA'!B18))","v":21100},{"$f":"IF($B$19,'Půjčovna ALEA'!C18,IF(E27=0,\"\",'Půjčovna ALEA'!C18))","v":210},{"$f":"IF($B$19,IF($J$17,IF($C$53<4,'Půjčovna ALEA'!C18,IF($C$53<7,'Půjčovna ALEA'!D18,IF($C$53>6,'Půjčovna ALEA'!E18)))*(1-'Půjčovna ALEA'!$E$38),IF($C$53<4,'Půjčovna ALEA'!C18,IF($C$53<7,'Půjčovna ALEA'!D18,IF($C$53>6,'Půjčovna ALEA'!E18)))),IF(E27>0,IF($J$17,IF($C$53<4,'Půjčovna ALEA'!C18,IF($C$53<7,'Půjčovna ALEA'!D18,IF($C$53>6,'Půjčovna ALEA'!E18)))*(1-'Půjčovna ALEA'!$E$38),IF($C$53<4,'Půjčovna ALEA'!C18,IF($C$53<7,'Půjčovna ALEA'!D18,IF($C$53>6,'Půjčovna ALEA'!E18)))),0))","v":210},{"$f":"IF($C$14,IF(E27>0,'Půjčovna ALEA'!B18*E27,),IF($C$15,IF(E27>0,'Půjčovna ALEA'!B18/2*E27,),))","v":0},0]
[{"$f":"IF($B$19,'Půjčovna ALEA'!A19,IF(E28=0,\"\",'Půjčovna ALEA'!A19))","v":"AUTOMATIKA □ Apeks ATX40 (1.,2.stupeň,octo,tlak)"},null,null,null,null,{"$f":"IF($B$19,'Půjčovna ALEA'!B19,IF(E28=0,\"\",'Půjčovna ALEA'!B19))","v":14000},{"$f":"IF($B$19,'Půjčovna ALEA'!C19,IF(E28=0,\"\",'Půjčovna ALEA'!C19))","v":180},{"$f":"IF($B$19,IF($J$17,IF($C$53<4,'Půjčovna ALEA'!C19,IF($C$53<7,'Půjčovna ALEA'!D19,IF($C$53>6,'Půjčovna ALEA'!E19)))*(1-'Půjčovna ALEA'!$E$38),IF($C$53<4,'Půjčovna ALEA'!C19,IF($C$53<7,'Půjčovna ALEA'!D19,IF($C$53>6,'Půjčovna ALEA'!E19)))),IF(E28>0,IF($J$17,IF($C$53<4,'Půjčovna ALEA'!C19,IF($C$53<7,'Půjčovna ALEA'!D19,IF($C$53>6,'Půjčovna ALEA'!E19)))*(1-'Půjčovna ALEA'!$E$38),IF($C$53<4,'Půjčovna ALEA'!C19,IF($C$53<7,'Půjčovna ALEA'!D19,IF($C$53>6,'Půjčovna ALEA'!E19)))),0))","v":180},{"$f":"IF($C$14,IF(E28>0,'Půjčovna ALEA'!B19*E28,),IF($C$15,IF(E28>0,'Půjčovna ALEA'!B19/2*E28,),))","v":0},0]
[{"$f":"IF($B$19,'Půjčovna ALEA'!A20,IF(E29=0,\"\",'Půjčovna ALEA'!A20))","v":"SVĚTLO - □FINNLIGHT,□D520,□Beta50W,□XENON - aku,□nabíječka"},null,null,null,null,{"$f":"IF($B$19,'Půjčovna ALEA'!B20,IF(E29=0,\"\",'Půjčovna ALEA'!B20))","v":9500},{"$f":"IF($B$19,'Půjčovna ALEA'!C20,IF(E29=0,\"\",'Půjčovna ALEA'!C20))","v":150},{"$f":"IF($B$19,IF($J$17,IF($C$53<4,'Půjčovna ALEA'!C20,IF($C$53<7,'Půjčovna ALEA'!D20,IF($C$53>6,'Půjčovna ALEA'!E20)))*(1-'Půjčovna ALEA'!$E$38),IF($C$53<4,'Půjčovna ALEA'!C20,IF($C$53<7,'Půjčovna ALEA'!D20,IF($C$53>6,'Půjčovna ALEA'!E20)))),IF(E29>0,IF($J$17,IF($C$53<4,'Půjčovna ALEA'!C20,IF($C$53<7,'Půjčovna ALEA'!D20,IF($C$53>6,'Půjčovna ALEA'!E20)))*(1-'Půjčovna ALEA'!$E$38),IF($C$53<4,'Půjčovna ALEA'!C20,IF($C$53<7,'Půjčovna ALEA'!D20,IF($C$53>6,'Půjčovna ALEA'!E20)))),0))","v":150},{"$f":"IF($C$14,IF(E29>0,'Půjčovna ALEA'!B20*E29,),IF($C$15,IF(E29>0,'Půjčovna ALEA'!B20/2*E29,),))","v":0},0]
[{"$f":"IF($B$19,'Půjčovna ALEA'!A21,IF(E30=0,\"\",'Půjčovna ALEA'!A21))","v":"Zátěžový opasek"},null,null,null,null,{"$f":"IF($B$19,'Půjčovna ALEA'!B21,IF(E30=0,\"\",'Půjčovna ALEA'!B21))","v":400},{"$f":"IF($B$19,'Půjčovna ALEA'!C21,IF(E30=0,\"\",'Půjčovna ALEA'!C21))","v":10},{"$f":"IF($B$19,IF($J$17,IF($C$53<4,'Půjčovna ALEA'!C21,IF($C$53<7,'Půjčovna ALEA'!D21,IF($C$53>6,'Půjčovna ALEA'!E21)))*(1-'Půjčovna ALEA'!$E$38),IF($C$53<4,'Půjčovna ALEA'!C21,IF($C$53<7,'Půjčovna ALEA'!D21,IF($C$53>6,'Půjčovna ALEA'!E21)))),IF(E30>0,IF($J$17,IF($C$53<4,'Půjčovna ALEA'!C21,IF($C$53<7,'Půjčovna ALEA'!D21,IF($C$53>6,'Půjčovna ALEA'!E21)))*(1-'Půjčovna ALEA'!$E$38),IF($C$53<4,'Půjčovna ALEA'!C21,IF($C$53<7,'Půjčovna ALEA'!D21,IF($C$53>6,'Půjčovna ALEA'!E21)))),0))","v":10},{"$f":"IF($C$14,IF(E30>0,'Půjčovna ALEA'!B21*E30,),IF($C$15,IF(E30>0,'Půjčovna ALEA'!B21/2*E30,),))","v":0},0]
[{"$f":"IF($B$19,'Půjčovna ALEA'!A22,IF(E31=0,\"\",'Půjčovna ALEA'!A22))","v":"ZÁTĚŽ - Olověné závaží - ks kostek"},null,null,null,null,{"$f":"IF($B$19,'Půjčovna ALEA'!B22,IF(E31=0,\"\",'Půjčovna ALEA'!B22))","v":200},{"$f":"IF($B$19,'Půjčovna ALEA'!C22,IF(E31=0,\"\",'Půjčovna ALEA'!C22))","v":8},{"$f":"IF($B$19,IF($J$17,IF($C$53<4,'Půjčovna ALEA'!C22,IF($C$53<7,'Půjčovna ALEA'!D22,IF($C$53>6,'Půjčovna ALEA'!E22)))*(1-'Půjčovna ALEA'!$E$38),IF($C$53<4,'Půjčovna ALEA'!C22,IF($C$53<7,'Půjčovna ALEA'!D22,IF($C$53>6,'Půjčovna ALEA'!E22)))),IF(E31>0,IF($J$17,IF($C$53<4,'Půjčovna ALEA'!C22,IF($C$53<7,'Půjčovna ALEA'!D22,IF($C$53>6,'Půjčovna ALEA'!E22)))*(1-'Půjčovna ALEA'!$E$38),IF($C$53<4,'Půjčovna ALEA'!C22,IF($C$53<7,'Půjčovna ALEA'!D22,IF($C$53>6,'Půjčovna ALEA'!E22)))),0))","v":8},{"$f":"IF($C$14,IF(E31>0,'Půjčovna ALEA'!B22*E31,),IF($C$15,IF(E31>0,'Půjčovna ALEA'!B22/2*E31,),))","v":0},0]
[{"$f":"IF($B$19,'Půjčovna ALEA'!A23,IF(E32=0,\"\",'Půjčovna ALEA'!A23))","v":"Počítač Suunto ZOOP NOVO, Aqualung i330+USB nabíječka, VYPER"},null,null,null,null,{"$f":"IF($B$19,'Půjčovna ALEA'!B23,IF(E32=0,\"\",'Půjčovna ALEA'!B23))","v":9000},{"$f":"IF($B$19,'Půjčovna ALEA'!C23,IF(E32=0,\"\",'Půjčovna ALEA'!C23))","v":130},{"$f":"IF($B$19,IF($J$17,IF($C$53<4,'Půjčovna ALEA'!C23,IF($C$53<7,'Půjčovna ALEA'!D23,IF($C$53>6,'Půjčovna ALEA'!E23)))*(1-'Půjčovna ALEA'!$E$38),IF($C$53<4,'Půjčovna ALEA'!C23,IF($C$53<7,'Půjčovna ALEA'!D23,IF($C$53>6,'Půjčovna ALEA'!E23)))),IF(E32>0,IF($J$17,IF($C$53<4,'Půjčovna ALEA'!C23,IF($C$53<7,'Půjčovna ALEA'!D23,IF($C$53>6,'Půjčovna ALEA'!E23)))*(1-'Půjčovna ALEA'!$E$38),IF($C$53<4,'Půjčovna ALEA'!C23,IF($C$53<7,'Půjčovna ALEA'!D23,IF($C$53>6,'Půjčovna ALEA'!E23)))),0))","v":130},{"$f":"IF($C$14,IF(E32>0,'Půjčovna ALEA'!B23*E32,),IF($C$15,IF(E32>0,'Půjčovna ALEA'!B23/2*E32,),))","v":0},0]
[{"$f":"IF($B$19,'Půjčovna ALEA'!A24,IF(E33=0,\"\",'Půjčovna ALEA'!A24))","v":"□Kompas SUUNTO SK7, □Hloubkoměr (i v konzoli)"},null,null,null,null,{"$f":"IF($B$19,'Půjčovna ALEA'!B24,IF(E33=0,\"\",'Půjčovna ALEA'!B24))","v":2000},{"$f":"IF($B$19,'Půjčovna ALEA'!C24,IF(E33=0,\"\",'Půjčovna ALEA'!C24))","v":50},{"$f":"IF($B$19,IF($J$17,IF($C$53<4,'Půjčovna ALEA'!C24,IF($C$53<7,'Půjčovna ALEA'!D24,IF($C$53>6,'Půjčovna ALEA'!E24)))*(1-'Půjčovna ALEA'!$E$38),IF($C$53<4,'Půjčovna ALEA'!C24,IF($C$53<7,'Půjčovna ALEA'!D24,IF($C$53>6,'Půjčovna ALEA'!E24)))),IF(E33>0,IF($J$17,IF($C$53<4,'Půjčovna ALEA'!C24,IF($C$53<7,'Půjčovna ALEA'!D24,IF($C$53>6,'Půjčovna ALEA'!E24)))*(1-'Půjčovna ALEA'!$E$38),IF($C$53<4,'Půjčovna ALEA'!C24,IF($C$53<7,'Půjčovna ALEA'!D24,IF($C$53>6,'Půjčovna ALEA'!E24)))),0))","v":50},{"$f":"IF($C$14,IF(E33>0,'Půjčovna ALEA'!B24*E33,),IF($C$15,IF(E33>0,'Půjčovna ALEA'!B24/2*E33,),))","v":0},0]
[{"$f":"IF($B$19,'Půjčovna ALEA'!A25,IF(E34=0,\"\",'Půjčovna ALEA'!A25))","v":"Neoprenové botky BEUCHAT, BARE"},null,null,null,null,{"$f":"IF($B$19,'Půjčovna ALEA'!B25,IF(E34=0,\"\",'Půjčovna ALEA'!B25))","v":1500},{"$f":"IF($B$19,'Půjčovna ALEA'!C25,IF(E34=0,\"\",'Půjčovna ALEA'!C25))","v":50},{"$f":"IF($B$19,IF($J$17,IF($C$53<4,'Půjčovna ALEA'!C25,IF($C$53<7,'Půjčovna ALEA'!D25,IF($C$53>6,'Půjčovna ALEA'!E25)))*(1-'Půjčovna ALEA'!$E$38),IF($C$53<4,'Půjčovna ALEA'!C25,IF($C$53<7,'Půjčovna ALEA'!D25,IF($C$53>6,'Půjčovna ALEA'!E25)))),IF(E34>0,IF($J$17,IF($C$53<4,'Půjčovna ALEA'!C25,IF($C$53<7,'Půjčovna ALEA'!D25,IF($C$53>6,'Půjčovna ALEA'!E25)))*(1-'Půjčovna ALEA'!$E$38),IF($C$53<4,'Půjčovna ALEA'!C25,IF($C$53<7,'Půjčovna ALEA'!D25,IF($C$53>6,'Půjčovna ALEA'!E25)))),0))","v":50},{"$f":"IF($C$14,IF(E34>0,'Půjčovna ALEA'!B25*E34,),IF($C$15,IF(E34>0,'Půjčovna ALEA'!B25/2*E34,),))","v":0},0]
[{"$f":"IF($B$19,'Půjčovna ALEA'!A26,IF(E35=0,\"\",'Půjčovna ALEA'!A26))","v":"Ploutve ATOMIC SPLITFINS páskové"},null,null,null,null,{"$f":"IF($B$19,'Půjčovna ALEA'!B26,IF(E35=0,\"\",'Půjčovna ALEA'!B26))","v":5000},{"$f":"IF($B$19,'Půjčovna ALEA'!C26,IF(E35=0,\"\",'Půjčovna ALEA'!C26))","v":80},{"$f":"IF($B$19,IF($J$17,IF($C$53<4,'Půjčovna ALEA'!C26,IF($C$53<7,'Půjčovna ALEA'!D26,IF($C$53>6,'Půjčovna ALEA'!E26)))*(1-'Půjčovna ALEA'!$E$38),IF($C$53<4,'Půjčovna ALEA'!C26,IF($C$53<7,'Půjčovna ALEA'!D26,IF($C$53>6,'Půjčovna ALEA'!E26)))),IF(E35>0,IF($J$17,IF($C$53<4,'Půjčovna ALEA'!C26,IF($C$53<7,'Půjčovna ALEA'!D26,IF($C$53>6,'Půjčovna ALEA'!E26)))*(1-'Půjčovna ALEA'!$E$38),IF($C$53<4,'Půjčovna ALEA'!C26,IF($C$53<7,'Půjčovna ALEA'!D26,IF($C$53>6,'Půjčovna ALEA'!E26)))),0))","v":80},{"$f":"IF($C$14,IF(E35>0,'Půjčovna ALEA'!B26*E35,),IF($C$15,IF(E35>0,'Půjčovna ALEA'!B26/2*E35,),))","v":0},0]
[{"$f":"IF($B$19,'Půjčovna ALEA'!A27,IF(E36=0,\"\",'Půjčovna ALEA'!A27))","v":"□Plouvte bazénové BEUCHAT, TECHNISUB, □páskové TECHNISUB"},null,null,null,null,{"$f":"IF($B$19,'Půjčovna ALEA'!B27,IF(E36=0,\"\",'Půjčovna ALEA'!B27))","v":1000},{"$f":"IF($B$19,'Půjčovna ALEA'!C27,IF(E36=0,\"\",'Půjčovna ALEA'!C27))","v":50},{"$f":"IF($B$19,IF($J$17,IF($C$53<4,'Půjčovna ALEA'!C27,IF($C$53<7,'Půjčovna ALEA'!D27,IF($C$53>6,'Půjčovna ALEA'!E27)))*(1-'Půjčovna ALEA'!$E$38),IF($C$53<4,'Půjčovna ALEA'!C27,IF($C$53<7,'Půjčovna ALEA'!D27,IF($C$53>6,'Půjčovna ALEA'!E27)))),IF(E36>0,IF($J$17,IF($C$53<4,'Půjčovna ALEA'!C27,IF($C$53<7,'Půjčovna ALEA'!D27,IF($C$53>6,'Půjčovna ALEA'!E27)))*(1-'Půjčovna ALEA'!$E$38),IF($C$53<4,'Půjčovna ALEA'!C27,IF($C$53<7,'Půjčovna ALEA'!D27,IF($C$53>6,'Půjčovna ALEA'!E27)))),0))","v":50},{"$f":"IF($C$14,IF(E36>0,'Půjčovna ALEA'!B27*E36,),IF($C$15,IF(E36>0,'Půjčovna ALEA'!B27/2*E36,),))","v":0},0]
[{"$f":"IF($B$19,'Půjčovna ALEA'!A28,IF(E37=0,\"\",'Půjčovna ALEA'!A28))","v":"MASKA - Silikonová BARE, TECHNISUB…"},null,null,null,null,{"$f":"IF($B$19,'Půjčovna ALEA'!B28,IF(E37=0,\"\",'Půjčovna ALEA'!B28))","v":1500},{"$f":"IF($B$19,'Půjčovna ALEA'!C28,IF(E37=0,\"\",'Půjčovna ALEA'!C28))","v":50},{"$f":"IF($B$19,IF($J$17,IF($C$53<4,'Půjčovna ALEA'!C28,IF($C$53<7,'Půjčovna ALEA'!D28,IF($C$53>6,'Půjčovna ALEA'!E28)))*(1-'Půjčovna ALEA'!$E$38),IF($C$53<4,'Půjčovna ALEA'!C28,IF($C$53<7,'Půjčovna ALEA'!D28,IF($C$53>6,'Půjčovna ALEA'!E28)))),IF(E37>0,IF($J$17,IF($C$53<4,'Půjčovna ALEA'!C28,IF($C$53<7,'Půjčovna ALEA'!D28,IF($C$53>6,'Půjčovna ALEA'!E28)))*(1-'Půjčovna ALEA'!$E$38),IF($C$53<4,'Půjčovna ALEA'!C28,IF($C$53<7,'Půjčovna ALEA'!D28,IF($C$53>6,'Půjčovna ALEA'!E28)))),0))","v":50},{"$f":"IF($C$14,IF(E37>0,'Půjčovna ALEA'!B28*E37,),IF($C$15,IF(E37>0,'Půjčovna ALEA'!B28/2*E37,),))","v":0},0]
[{"$f":"IF($B$19,'Půjčovna ALEA'!A29,IF(E38=0,\"\",'Půjčovna ALEA'!A29))","v":"□Šnorchl, □ostatní rukavice, □ostatní botky"},null,null,null,null,{"$f":"IF($B$19,'Půjčovna ALEA'!B29,IF(E38=0,\"\",'Půjčovna ALEA'!B29))","v":500},{"$f":"IF($B$19,'Půjčovna ALEA'!C29,IF(E38=0,\"\",'Půjčovna ALEA'!C29))","v":20},{"$f":"IF($B$19,IF($J$17,IF($C$53<4,'Půjčovna ALEA'!C29,IF($C$53<7,'Půjčovna ALEA'!D29,IF($C$53>6,'Půjčovna ALEA'!E29)))*(1-'Půjčovna ALEA'!$E$38),IF($C$53<4,'Půjčovna ALEA'!C29,IF($C$53<7,'Půjčovna ALEA'!D29,IF($C$53>6,'Půjčovna ALEA'!E29)))),IF(E38>0,IF($J$17,IF($C$53<4,'Půjčovna ALEA'!C29,IF($C$53<7,'Půjčovna ALEA'!D29,IF($C$53>6,'Půjčovna ALEA'!E29)))*(1-'Půjčovna ALEA'!$E$38),IF($C$53<4,'Půjčovna ALEA'!C29,IF($C$53<7,'Půjčovna ALEA'!D29,IF($C$53>6,'Půjčovna ALEA'!E29)))),0))","v":20},{"$f":"IF($C$14,IF(E38>0,'Půjčovna ALEA'!B29*E38,),IF($C$15,IF(E38>0,'Půjčovna ALEA'!B29/2*E38,),))","v":0},0]
[{"$f":"IF($B$19,'Půjčovna ALEA'!A30,IF(E39=0,\"\",'Půjčovna ALEA'!A30))","v":"RUKAVICE - BARE Kevlar 5mm"},null,null,null,null,{"$f":"IF($B$19,'Půjčovna ALEA'!B30,IF(E39=0,\"\",'Půjčovna ALEA'!B30))","v":1500},{"$f":"IF($B$19,'Půjčovna ALEA'!C30,IF(E39=0,\"\",'Půjčovna ALEA'!C30))","v":35},{"$f":"IF($B$19,IF($J$17,IF($C$53<4,'Půjčovna ALEA'!C30,IF($C$53<7,'Půjčovna ALEA'!D30,IF($C$53>6,'Půjčovna ALEA'!E30)))*(1-'Půjčovna ALEA'!$E$38),IF($C$53<4,'Půjčovna ALEA'!C30,IF($C$53<7,'Půjčovna ALEA'!D30,IF($C$53>6,'Půjčovna ALEA'!E30)))),IF(E39>0,IF($J$17,IF($C$53<4,'Půjčovna ALEA'!C30,IF($C$53<7,'Půjčovna ALEA'!D30,IF($C$53>6,'Půjčovna ALEA'!E30)))*(1-'Půjčovna ALEA'!$E$38),IF($C$53<4,'Půjčovna ALEA'!C30,IF($C$53<7,'Půjčovna ALEA'!D30,IF($C$53>6,'Půjčovna ALEA'!E30)))),0))","v":35},{"$f":"IF($C$14,IF(E39>0,'Půjčovna ALEA'!B30*E39,),IF($C$15,IF(E39>0,'Půjčovna ALEA'!B30/2*E39,),))","v":0},0]
[{"$f":"IF($B$19,'Půjčovna ALEA'!A31,IF(E40=0,\"\",'Půjčovna ALEA'!A31))","v":"□Nůž, □Redukce DIN/INT, □Deco boje"},null,null,null,null,{"$f":"IF($B$19,'Půjčovna ALEA'!B31,IF(E40=0,\"\",'Půjčovna ALEA'!B31))","v":1500},{"$f":"IF($B$19,'Půjčovna ALEA'!C31,IF(E40=0,\"\",'Půjčovna ALEA'!C31))","v":20},{"$f":"IF($B$19,IF($J$17,IF($C$53<4,'Půjčovna ALEA'!C31,IF($C$53<7,'Půjčovna ALEA'!D31,IF($C$53>6,'Půjčovna ALEA'!E31)))*(1-'Půjčovna ALEA'!$E$38),IF($C$53<4,'Půjčovna ALEA'!C31,IF($C$53<7,'Půjčovna ALEA'!D31,IF($C$53>6,'Půjčovna ALEA'!E31)))),IF(E40>0,IF($J$17,IF($C$53<4,'Půjčovna ALEA'!C31,IF($C$53<7,'Půjčovna ALEA'!D31,IF($C$53>6,'Půjčovna ALEA'!E31)))*(1-'Půjčovna ALEA'!$E$38),IF($C$53<4,'Půjčovna ALEA'!C31,IF($C$53<7,'Půjčovna ALEA'!D31,IF($C$53>6,'Půjčovna ALEA'!E31)))),0))","v":20},{"$f":"IF($C$14,IF(E40>0,'Půjčovna ALEA'!B31*E40,),IF($C$15,IF(E40>0,'Půjčovna ALEA'!B31/2*E40,),))","v":0},0]
[{"$f":"IF($B$19,'Půjčovna ALEA'!A32,IF(E41=0,\"\",'Půjčovna ALEA'!A32))","v":"Bedna na výstroj - AKCE - půjčovné ZDARMA"},null,null,null,null,{"$f":"IF($B$19,'Půjčovna ALEA'!B32,IF(E41=0,\"\",'Půjčovna ALEA'!B32))","v":500},{"$f":"IF($B$19,'Půjčovna ALEA'!C32,IF(E41=0,\"\",'Půjčovna ALEA'!C32))","v":0},{"$f":"IF($B$19,IF($J$17,IF($C$53<4,'Půjčovna ALEA'!C32,IF($C$53<7,'Půjčovna ALEA'!D32,IF($C$53>6,'Půjčovna ALEA'!E32)))*(1-'Půjčovna ALEA'!$E$38),IF($C$53<4,'Půjčovna ALEA'!C32,IF($C$53<7,'Půjčovna ALEA'!D32,IF($C$53>6,'Půjčovna ALEA'!E32)))),IF(E41>0,IF($J$17,IF($C$53<4,'Půjčovna ALEA'!C32,IF($C$53<7,'Půjčovna ALEA'!D32,IF($C$53>6,'Půjčovna ALEA'!E32)))*(1-'Půjčovna ALEA'!$E$38),IF($C$53<4,'Půjčovna ALEA'!C32,IF($C$53<7,'Půjčovna ALEA'!D32,IF($C$53>6,'Půjčovna ALEA'!E32)))),0))","v":0},{"$f":"IF($C$14,IF(E41>0,'Půjčovna ALEA'!B32*E41,),IF($C$15,IF(E41>0,'Půjčovna ALEA'!B32/2*E41,),))","v":0},0]
[{"$f":"IF($B$19,'Půjčovna ALEA'!A33,IF(E42=0,\"\",'Půjčovna ALEA'!A33))","v":"Plnění lahví 1L (% EANx)"},{"$f":"IF(AND(E21>0,E42=\"\"),\"PŘIPOČÍTAT VZDUCH\",\"\")","v":""},null,0.21,null,{"$f":"IF($B$19,'Půjčovna ALEA'!B33,IF(E42=0,\"\",'Půjčovna ALEA'!B33))","v":0},{"$f":"'Půjčovna ALEA'!C33","v":12},{"$f":"ROUND(IF($J$17,G42*0.8,G42),0)","v":12},null,{"$f":"IF(D42>0.21,I42+H42*E42*(1+D42),I42+H42*E42)","v":0}]
[null,null,null,null,null,null,null,null,null,{"$f":"I43+H43*E43*$C$53+F43","v":0}]
[null,null,null,null,null,null,null,null,null,{"$f":"I44+H44*E44*$C$53+F44","v":0}]
[null,null,null,null,null,null,null,null,null,{"$f":"I45+H45*E45*$C$53+F45","v":0}]
["Doprava výstroje na námi pořádané akce a kurzy - počet km",null,null,null,null,"Km",0.5,"Kč/Km",null,{"$f":"G46*E46","v":0}]
["Celkem",null,null,null,null,null,null,null,null,{"$f":"SUM(J21:J46)","v":0}]
[]
["Poznámky"]
[]
[]
[null,"Datum zapůjčení: ","2023-09-14",null,null,null,"Datum vrácení:","2023-09-15"]
[null,"Celkem účtovaných dní:",{"$f":"H52-C52","v":1},null,"4 - 6 dní sleva 17%"]
[null,null,null,null,"7 a více dní sleva 25%"]
[]
["Beru na vědomí, že materiál a učebnice mi jsou zapůjčeny a jsem povinen je vrátit v dohodnutém termínu. Při nedodržení termínu vrácení zaplatím za každý započatý den dvojnásobnou sazbu půjčovného. Souhlasím s tím, že budu zapůjčený materiál udržovat a zacházet s ním opatrně. Zodpovídám také za poškození materiálu z nedbalosti nebo za jeho ztrátu, v tom případě uhradím náklady spojené s pořízením poškozené nebo ztracené věci v plné výši. Souhlasím s pořízením kopie OP/pasu."]
[]
["Datum: ",{"$f":"TODAY()","v":"2023-09-14"},null,null,"Podpis:","_______________________"]
[]
[]
["SMLOUVA O ZAPŮJČENÍ VÝSTROJE"]
["ZPROŠTĚNÍ ODPOVĚDNOSTI A VÝSLOVNÉ PŘEVZETÍ RIZIKA"]
[]
["Tato smlouva je uzavřena mezi ALEA Divers - Jiří Jarkovský, ALEA s.r.o. a"]
[{"$f":"\"a \"&UPPER(B8)","v":"a "},null,"dále jen „nájemce\""]
["pro zapůjčení potápěčské přístrojové a/nebo šnorchlovací výstroje."]
["Tato smlouva je zproštěním práva nájemce na žalobu za zranění nebo smrt následkem zapůjčení a/nebo použití této výstroje. Nájemce výslovně přebírá veškerá rizika spojená s šnorchlování a/nebo potápěním s přístrojem vztahujícímu se jakýmkoliv způsobem k zapůjčené výstroji a/nebo použití této výstroje.                      ."]
["Nájemce tímto ztvrzuje obdržení výstroje zapsané v tomto Formuláři, a pokud cokoliv z této výstroje bude použito pro potápění s přístrojem, že nájemce je kvalifikovaný potápěč s přístrojem nebo student potápěč v kursu/programu potápění s přístrojem pod dohledem kvalifikovaného potápěčského instruktora.                   ."]
["Nájemce potvrzuje, že tato výstroj je v dobré funkční kondici a že si vyzkoušel výstroj pro ujištění, že nemá žádné defekty, včetně kontroly obojího kvality i kvantity vzduchu v jakékoliv zapůjčené láhvi.                      ."]
["Nájemce také rozumí, že ALEA Divers - Jiří Jarkovský, ALEA s.r.o. a jeho zaměstnanci, majitelé, funkcionáři nebo agenti (dále jen „Zproštěné Strany“), nemohou být činěni odpovědnými a jakkoliv zodpovídat za jakékoliv zranění, smrt nebo jiné škody nájemce nebo jeho rodiny, dědiců a zástupců, které mohou nastat jako následek zapůjčení a/nebo používání výstroje, nebo jako následek poruchy produktu, nebo nedbalostí jakékoliv strany, včetně Zproštěných Stran, ať už pasivní nebo aktivní.                                                                                               ."]
["Nájemce souhlasí nahradit ALEA Divers - Jiří Jarkovský, ALEA s.r.o. ztrátu nebo poškození jakékoliv a veškeré výstroje v platné náhradní hodnotě a také nahradit ztráty způsobené při transportování výstroje. "]
["Nájemce souhlasí vrátit výstroj v čisté podobě a zaplatit za čištění, pokud je v čistotě nevrátí.                           ."]
["Rozumím, že podmínky zde uvedené jsou smluvní a ne pouhé konstatování, a že jsem podepsal tento dokument ze své vlastní svobodné vůle a s vědomím, že tímto souhlasím vzdát se svých právních nároků.                   ."]
["Dále souhlasím, že pokud se některé ustanovení této Smlouvy stane neplatným nebo neúčinným, může být takové ustanovení vypuštěno z této smlouvy. Zbytek této smlouvy bude potom chápán tak, jako by toto neúčinné ustanovení nikdy neobsahovala.                                                                                                                    . "]
[]
[{"$f":"\"JÁ, \"&UPPER(B8)&\", JSEM POZORNĚ ČETL A POCHOPIL VÝŠE UVEDENOU SMLOUVU.\"","v":"JÁ, , JSEM POZORNĚ ČETL A POCHOPIL VÝŠE UVEDENOU SMLOUVU."}]
["PODEPSÁNÍM TÉTO SMLOUVY, ZPROŠŤUJI A ZBAVUJI ALEA Divers - Jiří Jarkovský, ALEA s.r.o. A VŠECHNY SOUVISEJÍCÍ CELKY JAK JSOU DEFINOVÁNY VÝŠE, VEŠKERÉ ODPOVĚDNOSTI A ZODPOVĚDNOSTI ZA JAKÉKOLIV OSOBNÍ ZRANĚNÍ, POŠKOZENÍ MAJETKU NEBO SMRTI, JAKO NÁSLEDEK ZAPŮJČENÍ A /NEBO POUŽITÍ TÉTO VÝSTROJE, JAKKOLIV ZPŮSOBENÉ, POČÍTAJE V TO, ALE NE LIMITOVÁNO NA NÁSLEDEK ODPOVĚDNOSTI NEBO NEDBALOSTI ZPROŠTĚNÝCH STRAN, AŤ UŽ PASIVNÍ NEBO AKTIVNÍ. ZPLNOMOCŇUJI ALEA Divers - Jiří Jarkovský, ALEA s.r.o. K ZATÍŽENÍ MOJÍ KREDITNÍ KARTY UVEDENÉ VÝŠE, ZA KAŽDÝ DEN POZDNÍHO VRÁCENÍ VÝTROJE."]
[]
[]
[]
[]
[null,null,null,null,{"$f":"TODAY()","v":"2023-09-14"}]
["Podpis nájemce ",null,null,"Datum (den/měsíc/rok)"]

{"sheet":"formulář věci na bazén_V.V.","index":2,"n_rows":35,"n_cols":33,"rows_kept":35,"cut":false,"hidden":false,"merged":[[19,30,20,30],[19,28,20,28],[19,29,20,29],[21,0,22,0],[19,20,20,20],[19,22,20,22],[19,24,20,24],[19,26,20,26],[19,13,19,14],[19,16,20,16],[19,18,20,18],[19,4,20,4],[19,6,20,6],[19,7,20,7],[19,9,20,9],[19,11,20,11],[18,1,18,3],[1,13,1,14],[1,6,2,6],[1,7,2,7],[1,11,2,11],[1,28,2,28],[3,0,4,0],[1,26,2,26],[1,9,2,9],[1,24,2,24],[0,4,0,15],[1,30,2,30],[1,16,2,16],[34,0,34,3],[34,27,34,31],[0,16,0,20],[18,16,18,20],[15,0,15,2],[16,27,16,31],[16,0,16,3],[0,1,0,3],[1,4,2,4],[1,18,2,18],[1,20,2,20],[1,22,2,22],[1,29,2,29]]}
[null,"Rozpis věcí na:",null,null,"Bazen Kralupy",null,null,null,null,null,null,null,null,null,null,null,"2023-09-12",null,null,null,null,false,"BAZEN",null,null,false,"VOLNA VODA"]
[null,"Nářadí     O2     podložka…",null,null,"Láhev velikost",null,"Pásek","Olovo počet ks",null,"BCD (vel./čís.)  tec - int.",null,"reg (číslo)",null,"s-seac a-aqua      d-dam p-pan",null,null,"rukavice",null,"maska",null,"ploutve       s - SPLIT",null,"botky           o - old",null,"počítač",null,"světlo",null,"Dopr. KM","Počet dní","Cena  baz","Ostatní"]
["Datum zápisu","Jméno a příjmení","Kontakt / důvod","Kč",null,null,null,null,null,null,null,null,null,"oblek dlouhý","oblek short"]
[{"$f":" TODAY()","v":"2023-09-14"},null,null,{"$f":"(IF(AG4,(F4+I4+K4+M4+P4+R4+T4+V4+X4+Z4+AB4)*(1-'Půjčovna ALEA'!$E$38),F4+I4+K4+M4+P4+R4+T4+V4+X4+Z4+AB4)+IF(ISNUMBER(VALUE(AE4)),AE4,0)+'formulář půjčovna'!$G$46*IF(ISNUMBER(VALUE(AC4)),AC4,0))*IF(AND(ISNUMBER(VALUE(AD4)),AD4>0),AD4,1)","v":0},null,{"$f":"IF(E4<>\"\",IF(ISNUMBER(VALUE(E4)),'Půjčovna ALEA'!C$13+(E4*'Půjčovna ALEA'!C$33),('Půjčovna ALEA'!C$13+(10*'Půjčovna ALEA'!C$33))),0)","v":0},null,null,{"$f":"IF((G4<>\"\"),'Půjčovna ALEA'!C$21,0)+(IF((H4<>\"\"),IF(ISNUMBER(VALUE(H4)),('Půjčovna ALEA'!C$22*H4),(('Půjčovna ALEA'!C$22)*6)),0))","v":0},null,{"$f":"IF((J4<>\"\"),IF((LEFT(J4,3)=\"tec\"),'Půjčovna ALEA'!C$15,'Půjčovna ALEA'!C$13),0)","v":0},null,{"$f":"IF((L4<>\"\"),'Půjčovna ALEA'!C$18,0)","v":0},null,null,{"$f":"IF((N4<>\"\"),IF((LEFT(N4,1)=\"o\"),'Půjčovna ALEA'!C$16,'Půjčovna ALEA'!C$17),0)+IF((O4<>\"\"),IF((LEFT(O4,1)=\"o\"),'Půjčovna ALEA'!C$16,'Půjčovna ALEA'!C$17),0)","v":0},null,{"$f":"IF((Q4<>\"\"),'Půjčovna ALEA'!C$30,0)","v":0},null,{"$f":"IF((S4<>\"\"),'Půjčovna ALEA'!C$28,0)","v":0},null,{"$f":"IF((U4<>\"\"),IF((LEFT(U4,1)=\"s\"),'Půjčovna ALEA'!C$26,'Půjčovna ALEA'!C$27),0)","v":0},null,{"$f":"IF((W4<>\"\"),IF((LEFT(W4,1)=\"o\"),'Půjčovna ALEA'!C$29,'Půjčovna ALEA'!C$25),0)","v":0},null,{"$f":"IF((Y4<>\"\"),'Půjčovna ALEA'!C$23,0)","v":0},null,{"$f":"IF((AA4<>\"\"),IF((LEFT(AA4,1)=\"l\"),'Půjčovna ALEA'!C$19,'Půjčovna ALEA'!C$20),0)","v":0}]
[null,null,null,{"$f":"(IF(AG5,(F5+I5+K5+M5+P5+R5+T5+V5+X5+Z5+AB5)*(1-'Půjčovna ALEA'!$E$38),F5+I5+K5+M5+P5+R5+T5+V5+X5+Z5+AB5)+IF(ISNUMBER(VALUE(AE5)),AE5,0)+'formulář půjčovna'!$G$46*IF(ISNUMBER(VALUE(AC5)),AC5,0))*IF(AND(ISNUMBER(VALUE(AD5)),AD5>0),AD5,1)","v":0},null,{"$f":"IF(E5<>\"\",IF(ISNUMBER(VALUE(E5)),'Půjčovna ALEA'!C$13+(E5*'Půjčovna ALEA'!C$33),('Půjčovna ALEA'!C$13+(10*'Půjčovna ALEA'!C$33))),0)","v":0},null,null,{"$f":"IF((G5<>\"\"),'Půjčovna ALEA'!C$21,0)+(IF((H5<>\"\"),IF(ISNUMBER(VALUE(H5)),('Půjčovna ALEA'!C$22*H5),(('Půjčovna ALEA'!C$22)*6)),0))","v":0},null,{"$f":"IF((J5<>\"\"),IF((LEFT(J5,3)=\"tec\"),'Půjčovna ALEA'!C$15,'Půjčovna ALEA'!C$13),0)","v":0},null,{"$f":"IF((L5<>\"\"),'Půjčovna ALEA'!C$18,0)","v":0},null,null,{"$f":"IF((N5<>\"\"),IF((LEFT(N5,1)=\"o\"),'Půjčovna ALEA'!C$16,'Půjčovna ALEA'!C$17),0)+IF((O5<>\"\"),IF((LEFT(O5,1)=\"o\"),'Půjčovna ALEA'!C$16,'Půjčovna ALEA'!C$17),0)","v":0},null,{"$f":"IF((Q5<>\"\"),'Půjčovna ALEA'!C$30,0)","v":0},null,{"$f":"IF((S5<>\"\"),'Půjčovna ALEA'!C$28,0)","v":0},null,{"$f":"IF((U5<>\"\"),IF((LEFT(U5,1)=\"s\"),'Půjčovna ALEA'!C$26,'Půjčovna ALEA'!C$27),0)","v":0},null,{"$f":"IF((W5<>\"\"),IF((LEFT(W5,1)=\"o\"),'Půjčovna ALEA'!C$29,'Půjčovna ALEA'!C$25),0)","v":0},null,{"$f":"IF((Y5<>\"\"),'Půjčovna ALEA'!C$23,0)","v":0},null,{"$f":"IF((AA5<>\"\"),IF((LEFT(AA5,1)=\"l\"),'Půjčovna ALEA'!C$19,'Půjčovna ALEA'!C$20),0)","v":0}]
[3,null,null,{"$f":"(IF(AG6,(F6+I6+K6+M6+P6+R6+T6+V6+X6+Z6+AB6)*(1-'Půjčovna ALEA'!$E$38),F6+I6+K6+M6+P6+R6+T6+V6+X6+Z6+AB6)+IF(ISNUMBER(VALUE(AE6)),AE6,0)+'formulář půjčovna'!$G$46*IF(ISNUMBER(VALUE(AC6)),AC6,0))*IF(AND(ISNUMBER(VALUE(AD6)),AD6>0),AD6,1)","v":0},null,{"$f":"IF(E6<>\"\",IF(ISNUMBER(VALUE(E6)),'Půjčovna ALEA'!C$13+(E6*'Půjčovna ALEA'!C$33),('Půjčovna ALEA'!C$13+(10*'Půjčovna ALEA'!C$33))),0)","v":0},null,null,{"$f":"IF((G6<>\"\"),'Půjčovna ALEA'!C$21,0)+(IF((H6<>\"\"),IF(ISNUMBER(VALUE(H6)),('Půjčovna ALEA'!C$22*H6),(('Půjčovna ALEA'!C$22)*6)),0))","v":0},null,{"$f":"IF((J6<>\"\"),IF((LEFT(J6,3)=\"tec\"),'Půjčovna ALEA'!C$15,'Půjčovna ALEA'!C$13),0)","v":0},null,{"$f":"IF((L6<>\"\"),'Půjčovna ALEA'!C$18,0)","v":0},null,null,{"$f":"IF((N6<>\"\"),IF((LEFT(N6,1)=\"o\"),'Půjčovna ALEA'!C$16,'Půjčovna ALEA'!C$17),0)+IF((O6<>\"\"),IF((LEFT(O6,1)=\"o\"),'Půjčovna ALEA'!C$16,'Půjčovna ALEA'!C$17),0)","v":0},null,{"$f":"IF((Q6<>\"\"),'Půjčovna ALEA'!C$30,0)","v":0},null,{"$f":"IF((S6<>\"\"),'Půjčovna ALEA'!C$28,0)","v":0},null,{"$f":"IF((U6<>\"\"),IF((LEFT(U6,1)=\"s\"),'Půjčovna ALEA'!C$26,'Půjčovna ALEA'!C$27),0)","v":0},null,{"$f":"IF((W6<>\"\"),IF((LEFT(W6,1)=\"o\"),'Půjčovna ALEA'!C$29,'Půjčovna ALEA'!C$25),0)","v":0},null,{"$f":"IF((Y6<>\"\"),'Půjčovna ALEA'!C$23,0)","v":0},null,{"$f":"IF((AA6<>\"\"),IF((LEFT(AA6,1)=\"l\"),'Půjčovna ALEA'!C$19,'Půjčovna ALEA'!C$20),0)","v":0}]
[4,null,null,{"$f":"(IF(AG7,(F7+I7+K7+M7+P7+R7+T7+V7+X7+Z7+AB7)*(1-'Půjčovna ALEA'!$E$38),F7+I7+K7+M7+P7+R7+T7+V7+X7+Z7+AB7)+IF(ISNUMBER(VALUE(AE7)),AE7,0)+'formulář půjčovna'!$G$46*IF(ISNUMBER(VALUE(AC7)),AC7,0))*IF(AND(ISNUMBER(VALUE(AD7)),AD7>0),AD7,1)","v":0},null,{"$f":"IF(E7<>\"\",IF(ISNUMBER(VALUE(E7)),'Půjčovna ALEA'!C$13+(E7*'Půjčovna ALEA'!C$33),('Půjčovna ALEA'!C$13+(10*'Půjčovna ALEA'!C$33))),0)","v":0},null,null,{"$f":"IF((G7<>\"\"),'Půjčovna ALEA'!C$21,0)+(IF((H7<>\"\"),IF(ISNUMBER(VALUE(H7)),('Půjčovna ALEA'!C$22*H7),(('Půjčovna ALEA'!C$22)*6)),0))","v":0},null,{"$f":"IF((J7<>\"\"),IF((LEFT(J7,3)=\"tec\"),'Půjčovna ALEA'!C$15,'Půjčovna ALEA'!C$13),0)","v":0},null,{"$f":"IF((L7<>\"\"),'Půjčovna ALEA'!C$18,0)","v":0},null,null,{"$f":"IF((N7<>\"\"),IF((LEFT(N7,1)=\"o\"),'Půjčovna ALEA'!C$16,'Půjčovna ALEA'!C$17),0)+IF((O7<>\"\"),IF((LEFT(O7,1)=\"o\"),'Půjčovna ALEA'!C$16,'Půjčovna ALEA'!C$17),0)","v":0},null,{"$f":"IF((Q7<>\"\"),'Půjčovna ALEA'!C$30,0)","v":0},null,{"$f":"IF((S7<>\"\"),'Půjčovna ALEA'!C$28,0)","v":0},null,{"$f":"IF((U7<>\"\"),IF((LEFT(U7,1)=\"s\"),'Půjčovna ALEA'!C$26,'Půjčovna ALEA'!C$27),0)","v":0},null,{"$f":"IF((W7<>\"\"),IF((LEFT(W7,1)=\"o\"),'Půjčovna ALEA'!C$29,'Půjčovna ALEA'!C$25),0)","v":0},null,{"$f":"IF((Y7<>\"\"),'Půjčovna ALEA'!C$23,0)","v":0},null,{"$f":"IF((AA7<>\"\"),IF((LEFT(AA7,1)=\"l\"),'Půjčovna ALEA'!C$19,'Půjčovna ALEA'!C$20),0)","v":0}]
[5,null,null,{"$f":"(IF(AG8,(F8+I8+K8+M8+P8+R8+T8+V8+X8+Z8+AB8)*(1-'Půjčovna ALEA'!$E$38),F8+I8+K8+M8+P8+R8+T8+V8+X8+Z8+AB8)+IF(ISNUMBER(VALUE(AE8)),AE8,0)+'formulář půjčovna'!$G$46*IF(ISNUMBER(VALUE(AC8)),AC8,0))*IF(AND(ISNUMBER(VALUE(AD8)),AD8>0),AD8,1)","v":0},null,{"$f":"IF(E8<>\"\",IF(ISNUMBER(VALUE(E8)),'Půjčovna ALEA'!C$13+(E8*'Půjčovna ALEA'!C$33),('Půjčovna ALEA'!C$13+(10*'Půjčovna ALEA'!C$33))),0)","v":0},null,null,{"$f":"IF((G8<>\"\"),'Půjčovna ALEA'!C$21,0)+(IF((H8<>\"\"),IF(ISNUMBER(VALUE(H8)),('Půjčovna ALEA'!C$22*H8),(('Půjčovna ALEA'!C$22)*6)),0))","v":0},null,{"$f":"IF((J8<>\"\"),IF((LEFT(J8,3)=\"tec\"),'Půjčovna ALEA'!C$15,'Půjčovna ALEA'!C$13),0)","v":0},null,{"$f":"IF((L8<>\"\"),'Půjčovna ALEA'!C$18,0)","v":0},null,null,{"$f":"IF((N8<>\"\"),IF((LEFT(N8,1)=\"o\"),'Půjčovna ALEA'!C$16,'Půjčovna ALEA'!C$17),0)+IF((O8<>\"\"),IF((LEFT(O8,1)=\"o\"),'Půjčovna ALEA'!C$16,'Půjčovna ALEA'!C$17),0)","v":0},null,{"$f":"IF((Q8<>\"\"),'Půjčovna ALEA'!C$30,0)","v":0},null,{"$f":"IF((S8<>\"\"),'Půjčovna ALEA'!C$28,0)","v":0},null,{"$f":"IF((U8<>\"\"),IF((LEFT(U8,1)=\"s\"),'Půjčovna ALEA'!C$26,'Půjčovna ALEA'!C$27),0)","v":0},null,{"$f":"IF((W8<>\"\"),IF((LEFT(W8,1)=\"o\"),'Půjčovna ALEA'!C$29,'Půjčovna ALEA'!C$25),0)","v":0},null,{"$f":"IF((Y8<>\"\"),'Půjčovna ALEA'!C$23,0)","v":0},null,{"$f":"IF((AA8<>\"\"),IF((LEFT(AA8,1)=\"l\"),'Půjčovna ALEA'!C$19,'Půjčovna ALEA'!C$20),0)","v":0}]
[6,null,null,{"$f":"(IF(AG9,(F9+I9+K9+M9+P9+R9+T9+V9+X9+Z9+AB9)*(1-'Půjčovna ALEA'!$E$38),F9+I9+K9+M9+P9+R9+T9+V9+X9+Z9+AB9)+IF(ISNUMBER(VALUE(AE9)),AE9,0)+'formulář půjčovna'!$G$46*IF(ISNUMBER(VALUE(AC9)),AC9,0))*IF(AND(ISNUMBER(VALUE(AD9)),AD9>0),AD9,1)","v":0},null,{"$f":"IF(E9<>\"\",IF(ISNUMBER(VALUE(E9)),'Půjčovna ALEA'!C$13+(E9*'Půjčovna ALEA'!C$33),('Půjčovna ALEA'!C$13+(10*'Půjčovna ALEA'!C$33))),0)","v":0},null,null,{"$f":"IF((G9<>\"\"),'Půjčovna ALEA'!C$21,0)+(IF((H9<>\"\"),IF(ISNUMBER(VALUE(H9)),('Půjčovna ALEA'!C$22*H9),(('Půjčovna ALEA'!C$22)*6)),0))","v":0},null,{"$f":"IF((J9<>\"\"),IF((LEFT(J9,3)=\"tec\"),'Půjčovna ALEA'!C$15,'Půjčovna ALEA'!C$13),0)","v":0},null,{"$f":"IF((L9<>\"\"),'Půjčovna ALEA'!C$18,0)","v":0},null,null,{"$f":"IF((N9<>\"\"),IF((LEFT(N9,1)=\"o\"),'Půjčovna ALEA'!C$16,'Půjčovna ALEA'!C$17),0)+IF((O9<>\"\"),IF((LEFT(O9,1)=\"o\"),'Půjčovna ALEA'!C$16,'Půjčovna ALEA'!C$17),0)","v":0},null,{"$f":"IF((Q9<>\"\"),'Půjčovna ALEA'!C$30,0)","v":0},null,{"$f":"IF((S9<>\"\"),'Půjčovna ALEA'!C$28,0)","v":0},null,{"$f":"IF((U9<>\"\"),IF((LEFT(U9,1)=\"s\"),'Půjčovna ALEA'!C$26,'Půjčovna ALEA'!C$27),0)","v":0},null,{"$f":"IF((W9<>\"\"),IF((LEFT(W9,1)=\"o\"),'Půjčovna ALEA'!C$29,'Půjčovna ALEA'!C$25),0)","v":0},null,{"$f":"IF((Y9<>\"\"),'Půjčovna ALEA'!C$23,0)","v":0},null,{"$f":"IF((AA9<>\"\"),IF((LEFT(AA9,1)=\"l\"),'Půjčovna ALEA'!C$19,'Půjčovna ALEA'!C$20),0)","v":0}]
[7,null,null,{"$f":"(IF(AG10,(F10+I10+K10+M10+P10+R10+T10+V10+X10+Z10+AB10)*(1-'Půjčovna ALEA'!$E$38),F10+I10+K10+M10+P10+R10+T10+V10+X10+Z10+AB10)+IF(ISNUMBER(VALUE(AE10)),AE10,0)+'formulář půjčovna'!$G$46*IF(ISNUMBER(VALUE(AC10)),AC10,0))*IF(AND(ISNUMBER(VALUE(AD10)),AD10>0),AD10,1)","v":0},null,{"$f":"IF(E10<>\"\",IF(ISNUMBER(VALUE(E10)),'Půjčovna ALEA'!C$13+(E10*'Půjčovna ALEA'!C$33),('Půjčovna ALEA'!C$13+(10*'Půjčovna ALEA'!C$33))),0)","v":0},null,null,{"$f":"IF((G10<>\"\"),'Půjčovna ALEA'!C$21,0)+(IF((H10<>\"\"),IF(ISNUMBER(VALUE(H10)),('Půjčovna ALEA'!C$22*H10),(('Půjčovna ALEA'!C$22)*6)),0))","v":0},null,{"$f":"IF((J10<>\"\"),IF((LEFT(J10,3)=\"tec\"),'Půjčovna ALEA'!C$15,'Půjčovna ALEA'!C$13),0)","v":0},null,{"$f":"IF((L10<>\"\"),'Půjčovna ALEA'!C$18,0)","v":0},null,null,{"$f":"IF((N10<>\"\"),IF((LEFT(N10,1)=\"o\"),'Půjčovna ALEA'!C$16,'Půjčovna ALEA'!C$17),0)+IF((O10<>\"\"),IF((LEFT(O10,1)=\"o\"),'Půjčovna ALEA'!C$16,'Půjčovna ALEA'!C$17),0)","v":0},null,{"$f":"IF((Q10<>\"\"),'Půjčovna ALEA'!C$30,0)","v":0},null,{"$f":"IF((S10<>\"\"),'Půjčovna ALEA'!C$28,0)","v":0},null,{"$f":"IF((U10<>\"\"),IF((LEFT(U10,1)=\"s\"),'Půjčovna ALEA'!C$26,'Půjčovna ALEA'!C$27),0)","v":0},null,{"$f":"IF((W10<>\"\"),IF((LEFT(W10,1)=\"o\"),'Půjčovna ALEA'!C$29,'Půjčovna ALEA'!C$25),0)","v":0},null,{"$f":"IF((Y10<>\"\"),'Půjčovna ALEA'!C$23,0)","v":0},null,{"$f":"IF((AA10<>\"\"),IF((LEFT(AA10,1)=\"l\"),'Půjčovna ALEA'!C$19,'Půjčovna ALEA'!C$20),0)","v":0}]
[8,null,null,{"$f":"(IF(AG11,(F11+I11+K11+M11+P11+R11+T11+V11+X11+Z11+AB11)*(1-'Půjčovna ALEA'!$E$38),F11+I11+K11+M11+P11+R11+T11+V11+X11+Z11+AB11)+IF(ISNUMBER(VALUE(AE11)),AE11,0)+'formulář půjčovna'!$G$46*IF(ISNUMBER(VALUE(AC11)),AC11,0))*IF(AND(ISNUMBER(VALUE(AD11)),AD11>0),AD11,1)","v":0},null,{"$f":"IF(E11<>\"\",IF(ISNUMBER(VALUE(E11)),'Půjčovna ALEA'!C$13+(E11*'Půjčovna ALEA'!C$33),('Půjčovna ALEA'!C$13+(10*'Půjčovna ALEA'!C$33))),0)","v":0},null,null,{"$f":"IF((G11<>\"\"),'Půjčovna ALEA'!C$21,0)+(IF((H11<>\"\"),IF(ISNUMBER(VALUE(H11)),('Půjčovna ALEA'!C$22*H11),(('Půjčovna ALEA'!C$22)*6)),0))","v":0},null,{"$f":"IF((J11<>\"\"),IF((LEFT(J11,3)=\"tec\"),'Půjčovna ALEA'!C$15,'Půjčovna ALEA'!C$13),0)","v":0},null,{"$f":"IF((L11<>\"\"),'Půjčovna ALEA'!C$18,0)","v":0},null,null,{"$f":"IF((N11<>\"\"),IF((LEFT(N11,1)=\"o\"),'Půjčovna ALEA'!C$16,'Půjčovna ALEA'!C$17),0)+IF((O11<>\"\"),IF((LEFT(O11,1)=\"o\"),'Půjčovna ALEA'!C$16,'Půjčovna ALEA'!C$17),0)","v":0},null,{"$f":"IF((Q11<>\"\"),'Půjčovna ALEA'!C$30,0)","v":0},null,{"$f":"IF((S11<>\"\"),'Půjčovna ALEA'!C$28,0)","v":0},null,{"$f":"IF((U11<>\"\"),IF((LEFT(U11,1)=\"s\"),'Půjčovna ALEA'!C$26,'Půjčovna ALEA'!C$27),0)","v":0},null,{"$f":"IF((W11<>\"\"),IF((LEFT(W11,1)=\"o\"),'Půjčovna ALEA'!C$29,'Půjčovna ALEA'!C$25),0)","v":0},null,{"$f":"IF((Y11<>\"\"),'Půjčovna ALEA'!C$23,0)","v":0},null,{"$f":"IF((AA11<>\"\"),IF((LEFT(AA11,1)=\"l\"),'Půjčovna ALEA'!C$19,'Půjčovna ALEA'!C$20),0)","v":0}]
[9,null,null,{"$f":"(IF(AG12,(F12+I12+K12+M12+P12+R12+T12+V12+X12+Z12+AB12)*(1-'Půjčovna ALEA'!$E$38),F12+I12+K12+M12+P12+R12+T12+V12+X12+Z12+AB12)+IF(ISNUMBER(VALUE(AE12)),AE12,0)+'formulář půjčovna'!$G$46*IF(ISNUMBER(VALUE(AC12)),AC12,0))*IF(AND(ISNUMBER(VALUE(AD12)),AD12>0),AD12,1)","v":0},null,{"$f":"IF(E12<>\"\",IF(ISNUMBER(VALUE(E12)),'Půjčovna ALEA'!C$13+(E12*'Půjčovna ALEA'!C$33),('Půjčovna ALEA'!C$13+(10*'Půjčovna ALEA'!C$33))),0)","v":0},null,null,{"$f":"IF((G12<>\"\"),'Půjčovna ALEA'!C$21,0)+(IF((H12<>\"\"),IF(ISNUMBER(VALUE(H12)),('Půjčovna ALEA'!C$22*H12),(('Půjčovna ALEA'!C$22)*6)),0))","v":0},null,{"$f":"IF((J12<>\"\"),IF((LEFT(J12,3)=\"tec\"),'Půjčovna ALEA'!C$15,'Půjčovna ALEA'!C$13),0)","v":0},null,{"$f":"IF((L12<>\"\"),'Půjčovna ALEA'!C$18,0)","v":0},null,null,{"$f":"IF((N12<>\"\"),IF((LEFT(N12,1)=\"o\"),'Půjčovna ALEA'!C$16,'Půjčovna ALEA'!C$17),0)+IF((O12<>\"\"),IF((LEFT(O12,1)=\"o\"),'Půjčovna ALEA'!C$16,'Půjčovna ALEA'!C$17),0)","v":0},null,{"$f":"IF((Q12<>\"\"),'Půjčovna ALEA'!C$30,0)","v":0},null,{"$f":"IF((S12<>\"\"),'Půjčovna ALEA'!C$28,0)","v":0},null,{"$f":"IF((U12<>\"\"),IF((LEFT(U12,1)=\"s\"),'Půjčovna ALEA'!C$26,'Půjčovna ALEA'!C$27),0)","v":0},null,{"$f":"IF((W12<>\"\"),IF((LEFT(W12,1)=\"o\"),'Půjčovna ALEA'!C$29,'Půjčovna ALEA'!C$25),0)","v":0},null,{"$f":"IF((Y12<>\"\"),'Půjčovna ALEA'!C$23,0)","v":0},null,{"$f":"IF((AA12<>\"\"),IF((LEFT(AA12,1)=\"l\"),'Půjčovna ALEA'!C$19,'Půjčovna ALEA'!C$20),0)","v":0}]
[10,null,null,{"$f":"(IF(AG13,(F13+I13+K13+M13+P13+R13+T13+V13+X13+Z13+AB13)*(1-'Půjčovna ALEA'!$E$38),F13+I13+K13+M13+P13+R13+T13+V13+X13+Z13+AB13)+IF(ISNUMBER(VALUE(AE13)),AE13,0)+'formulář půjčovna'!$G$46*IF(ISNUMBER(VALUE(AC13)),AC13,0))*IF(AND(ISNUMBER(VALUE(AD13)),AD13>0),AD13,1)","v":0},null,{"$f":"IF(E13<>\"\",IF(ISNUMBER(VALUE(E13)),'Půjčovna ALEA'!C$13+(E13*'Půjčovna ALEA'!C$33),('Půjčovna ALEA'!C$13+(10*'Půjčovna ALEA'!C$33))),0)","v":0},null,null,{"$f":"IF((G13<>\"\"),'Půjčovna ALEA'!C$21,0)+(IF((H13<>\"\"),IF(ISNUMBER(VALUE(H13)),('Půjčovna ALEA'!C$22*H13),(('Půjčovna ALEA'!C$22)*6)),0))","v":0},null,{"$f":"IF((J13<>\"\"),IF((LEFT(J13,3)=\"tec\"),'Půjčovna ALEA'!C$15,'Půjčovna ALEA'!C$13),0)","v":0},null,{"$f":"IF((L13<>\"\"),'Půjčovna ALEA'!C$18,0)","v":0},null,null,{"$f":"IF((N13<>\"\"),IF((LEFT(N13,1)=\"o\"),'Půjčovna ALEA'!C$16,'Půjčovna ALEA'!C$17),0)+IF((O13<>\"\"),IF((LEFT(O13,1)=\"o\"),'Půjčovna ALEA'!C$16,'Půjčovna ALEA'!C$17),0)","v":0},null,{"$f":"IF((Q13<>\"\"),'Půjčovna ALEA'!C$30,0)","v":0},null,{"$f":"IF((S13<>\"\"),'Půjčovna ALEA'!C$28,0)","v":0},null,{"$f":"IF((U13<>\"\"),IF((LEFT(U13,1)=\"s\"),'Půjčovna ALEA'!C$26,'Půjčovna ALEA'!C$27),0)","v":0},null,{"$f":"IF((W13<>\"\"),IF((LEFT(W13,1)=\"o\"),'Půjčovna ALEA'!C$29,'Půjčovna ALEA'!C$25),0)","v":0},null,{"$f":"IF((Y13<>\"\"),'Půjčovna ALEA'!C$23,0)","v":0},null,{"$f":"IF((AA13<>\"\"),IF((LEFT(AA13,1)=\"l\"),'Půjčovna ALEA'!C$19,'Půjčovna ALEA'!C$20),0)","v":0}]
[11,null,null,{"$f":"(IF(AG14,(F14+I14+K14+M14+P14+R14+T14+V14+X14+Z14+AB14)*(1-'Půjčovna ALEA'!$E$38),F14+I14+K14+M14+P14+R14+T14+V14+X14+Z14+AB14)+IF(ISNUMBER(VALUE(AE14)),AE14,0)+'formulář půjčovna'!$G$46*IF(ISNUMBER(VALUE(AC14)),AC14,0))*IF(AND(ISNUMBER(VALUE(AD14)),AD14>0),AD14,1)","v":0},null,{"$f":"IF(E14<>\"\",IF(ISNUMBER(VALUE(E14)),'Půjčovna ALEA'!C$13+(E14*'Půjčovna ALEA'!C$33),('Půjčovna ALEA'!C$13+(10*'Půjčovna ALEA'!C$33))),0)","v":0},null,null,{"$f":"IF((G14<>\"\"),'Půjčovna ALEA'!C$21,0)+(IF((H14<>\"\"),IF(ISNUMBER(VALUE(H14)),('Půjčovna ALEA'!C$22*H14),(('Půjčovna ALEA'!C$22)*6)),0))","v":0},null,{"$f":"IF((J14<>\"\"),IF((LEFT(J14,3)=\"tec\"),'Půjčovna ALEA'!C$15,'Půjčovna ALEA'!C$13),0)","v":0},null,{"$f":"IF((L14<>\"\"),'Půjčovna ALEA'!C$18,0)","v":0},null,null,{"$f":"IF((N14<>\"\"),IF((LEFT(N14,1)=\"o\"),'Půjčovna ALEA'!C$16,'Půjčovna ALEA'!C$17),0)+IF((O14<>\"\"),IF((LEFT(O14,1)=\"o\"),'Půjčovna ALEA'!C$16,'Půjčovna ALEA'!C$17),0)","v":0},null,{"$f":"IF((Q14<>\"\"),'Půjčovna ALEA'!C$30,0)","v":0},null,{"$f":"IF((S14<>\"\"),'Půjčovna ALEA'!C$28,0)","v":0},null,{"$f":"IF((U14<>\"\"),IF((LEFT(U14,1)=\"s\"),'Půjčovna ALEA'!C$26,'Půjčovna ALEA'!C$27),0)","v":0},null,{"$f":"IF((W14<>\"\"),IF((LEFT(W14,1)=\"o\"),'Půjčovna ALEA'!C$29,'Půjčovna ALEA'!C$25),0)","v":0},null,{"$f":"IF((Y14<>\"\"),'Půjčovna ALEA'!C$23,0)","v":0},null,{"$f":"IF((AA14<>\"\"),IF((LEFT(AA14,1)=\"l\"),'Půjčovna ALEA'!C$19,'Půjčovna ALEA'!C$20),0)","v":0}]
[12,null,null,{"$f":"(IF(AG15,(F15+I15+K15+M15+P15+R15+T15+V15+X15+Z15+AB15)*(1-'Půjčovna ALEA'!$E$38),F15+I15+K15+M15+P15+R15+T15+V15+X15+Z15+AB15)+IF(ISNUMBER(VALUE(AE15)),AE15,0)+'formulář půjčovna'!$G$46*IF(ISNUMBER(VALUE(AC15)),AC15,0))*IF(AND(ISNUMBER(VALUE(AD15)),AD15>0),AD15,1)","v":0},null,{"$f":"IF(E15<>\"\",IF(ISNUMBER(VALUE(E15)),'Půjčovna ALEA'!C$13+(E15*'Půjčovna ALEA'!C$33),('Půjčovna ALEA'!C$13+(10*'Půjčovna ALEA'!C$33))),0)","v":0},null,null,{"$f":"IF((G15<>\"\"),'Půjčovna ALEA'!C$21,0)+(IF((H15<>\"\"),IF(ISNUMBER(VALUE(H15)),('Půjčovna ALEA'!C$22*H15),(('Půjčovna ALEA'!C$22)*6)),0))","v":0},null,{"$f":"IF((J15<>\"\"),IF((LEFT(J15,3)=\"tec\"),'Půjčovna ALEA'!C$15,'Půjčovna ALEA'!C$13),0)","v":0},null,{"$f":"IF((L15<>\"\"),'Půjčovna ALEA'!C$18,0)","v":0},null,null,{"$f":"IF((N15<>\"\"),IF((LEFT(N15,1)=\"o\"),'Půjčovna ALEA'!C$16,'Půjčovna ALEA'!C$17),0)+IF((O15<>\"\"),IF((LEFT(O15,1)=\"o\"),'Půjčovna ALEA'!C$16,'Půjčovna ALEA'!C$17),0)","v":0},null,{"$f":"IF((Q15<>\"\"),'Půjčovna ALEA'!C$30,0)","v":0},null,{"$f":"IF((S15<>\"\"),'Půjčovna ALEA'!C$28,0)","v":0},null,{"$f":"IF((U15<>\"\"),IF((LEFT(U15,1)=\"s\"),'Půjčovna ALEA'!C$26,'Půjčovna ALEA'!C$27),0)","v":0},null,{"$f":"IF((W15<>\"\"),IF((LEFT(W15,1)=\"o\"),'Půjčovna ALEA'!C$29,'Půjčovna ALEA'!C$25),0)","v":0},null,{"$f":"IF((Y15<>\"\"),'Půjčovna ALEA'!C$23,0)","v":0},null,{"$f":"IF((AA15<>\"\"),IF((LEFT(AA15,1)=\"l\"),'Půjčovna ALEA'!C$19,'Půjčovna ALEA'!C$20),0)","v":0}]
["Náhradní                            výstroj",null,null,{"$f":"(IF(AF16,(F16+I16+K16+M16+P16+R16+T16+V16+X16+Z16+AB16)*(1-'Půjčovna ALEA'!$E$38),F16+I16+K16+M16+P16+R16+T16+V16+X16+Z16+AB16)+IF(ISNUMBER(VALUE(AE16)),AE16,0)+'formulář půjčovna'!$G$46*IF(ISNUMBER(VALUE(AC16)),AC16,0))*IF(AND(ISNUMBER(VALUE(AD16)),AD16>0),AD16,1)","v":1018}," ",{"$f":"IF(E16<>\"\",IF(ISNUMBER(VALUE(E16)),'Půjčovna ALEA'!C$13+(E16*'Půjčovna ALEA'!C$33),('Půjčovna ALEA'!C$13+(10*'Půjčovna ALEA'!C$33))),0)","v":240}," "," ",{"$f":"IF((G16<>\"\"),'Půjčovna ALEA'!C$21,0)+(IF((H16<>\"\"),IF(ISNUMBER(VALUE(H16)),('Půjčovna ALEA'!C$22*H16),(('Půjčovna ALEA'!C$22)*6)),0))","v":58}," ",{"$f":"IF((J16<>\"\"),IF((LEFT(J16,3)=\"tec\"),'Půjčovna ALEA'!C$15,'Půjčovna ALEA'!C$13),0)","v":120}," ",{"$f":"IF((L16<>\"\"),'Půjčovna ALEA'!C$18,0)","v":210},null," ",{"$f":"IF((N16<>\"\"),IF((LEFT(N16,1)=\"o\"),'Půjčovna ALEA'!C$16,'Půjčovna ALEA'!C$17),0)+IF((O16<>\"\"),IF((LEFT(O16,1)=\"o\"),'Půjčovna ALEA'!C$16,'Půjčovna ALEA'!C$17),0)","v":290},null,{"$f":"IF((Q16<>\"\"),'Půjčovna ALEA'!C$30,0)","v":0}," ",{"$f":"IF((S16<>\"\"),'Půjčovna ALEA'!C$28,0)","v":50}," ",{"$f":"IF((U16<>\"\"),IF((LEFT(U16,1)=\"s\"),'Půjčovna ALEA'!C$26,'Půjčovna ALEA'!C$27),0)","v":50},null,{"$f":"IF((W16<>\"\"),IF((LEFT(W16,1)=\"o\"),'Půjčovna ALEA'!C$29,'Půjčovna ALEA'!C$25),0)","v":0},null,{"$f":"IF((Y16<>\"\"),'Půjčovna ALEA'!C$23,0)","v":0},null,{"$f":"IF((AA16<>\"\"),IF((LEFT(AA16,1)=\"l\"),'Půjčovna ALEA'!C$19,'Půjčovna ALEA'!C$20),0)","v":0},null,null,null,false]
["Počty výstrojí na listu",null,null,null,{"$f":"IF(E4<>\"\",1,0)+IF(E5<>\"\",1,0)+IF(E6<>\"\",1,0)+IF(E7<>\"\",1,0)+IF(E8<>\"\",1,0)+IF(E9<>\"\",1,0)+IF(E10<>\"\",1,0)+IF(E11<>\"\",1,0)+IF(E12<>\"\",1,0)+IF(E13<>\"\",1,0)+IF(E14<>\"\",1,0)+IF(E15<>\"\",1,0)+IF(E16<>\"\",1,0)","v":1},null,{"$f":"IF(G4<>\"\",1,0)+IF(G5<>\"\",1,0)+IF(G6<>\"\",1,0)+IF(G7<>\"\",1,0)+IF(G8<>\"\",1,0)+IF(G9<>\"\",1,0)+IF(G10<>\"\",1,0)+IF(G11<>\"\",1,0)+IF(G12<>\"\",1,0)+IF(G13<>\"\",1,0)+IF(G14<>\"\",1,0)+IF(G15<>\"\",1,0)+IF(G16<>\"\",1,0)","v":1},{"$f":"IF(H4<>\"\",IF(H4=\" \",1,IF(H4>0,H4,1)),0)+IF(H5<>\"\",IF(H5=\" \",1,IF(H5>0,H5,1)),0)+IF(H6<>\"\",IF(H6=\" \",1,IF(H6>0,H6,1)),0)+IF(H7<>\"\",IF(H7=\" \",1,IF(H7>0,H7,1)),0)+IF(H8<>\"\",IF(H8=\" \",1,IF(H8>0,H8,1)),0)+IF(H9<>\"\",IF(H9=\" \",1,IF(H9>0,H9,1)),0)+IF(H10<>\"\",IF(H10=\" \",1,IF(H10>0,H10,1)),0)+IF(H11<>\"\",IF(H11=\" \",1,IF(H11>0,H11,1)),0)+IF(H12<>\"\",IF(H12=\" \",1,IF(H12>0,H12,1)),0)+IF(H13<>\"\",IF(H13=\" \",1,IF(H13>0,H13,1)),0)+IF(H14<>\"\",IF(H14=\" \",1,IF(H14>0,H14,1)),0)+IF(H15<>\"\",IF(H15=\" \",1,IF(H15>0,H15,1)),0)+IF(H16<>\"\",IF(H16=\" \",1,IF(H16>0,H16,1)),0)","v":1},null,{"$f":"IF(J4<>\"\",1,0)+IF(J5<>\"\",1,0)+IF(J6<>\"\",1,0)+IF(J7<>\"\",1,0)+IF(J8<>\"\",1,0)+IF(J9<>\"\",1,0)+IF(J10<>\"\",1,0)+IF(J11<>\"\",1,0)+IF(J12<>\"\",1,0)+IF(J13<>\"\",1,0)+IF(J14<>\"\",1,0)+IF(J15<>\"\",1,0)+IF(J16<>\"\",1,0)","v":1},null,{"$f":"IF(L4<>\"\",1,0)+IF(L5<>\"\",1,0)+IF(L6<>\"\",1,0)+IF(L7<>\"\",1,0)+IF(L8<>\"\",1,0)+IF(L9<>\"\",1,0)+IF(L10<>\"\",1,0)+IF(L11<>\"\",1,0)+IF(L12<>\"\",1,0)+IF(L13<>\"\",1,0)+IF(L14<>\"\",1,0)+IF(L15<>\"\",1,0)+IF(L16<>\"\",1,0)","v":1},null,{"$f":"IF(N4<>\"\",1,0)+IF(N5<>\"\",1,0)+IF(N6<>\"\",1,0)+IF(N7<>\"\",1,0)+IF(N8<>\"\",1,0)+IF(N9<>\"\",1,0)+IF(N10<>\"\",1,0)+IF(N11<>\"\",1,0)+IF(N12<>\"\",1,0)+IF(N13<>\"\",1,0)+IF(N14<>\"\",1,0)+IF(N15<>\"\",1,0)+IF(N16<>\"\",1,0)","v":0},{"$f":"IF(O4<>\"\",1,0)+IF(O5<>\"\",1,0)+IF(O6<>\"\",1,0)+IF(O7<>\"\",1,0)+IF(O8<>\"\",1,0)+IF(O9<>\"\",1,0)+IF(O10<>\"\",1,0)+IF(O11<>\"\",1,0)+IF(O12<>\"\",1,0)+IF(O13<>\"\",1,0)+IF(O14<>\"\",1,0)+IF(O15<>\"\",1,0)+IF(O16<>\"\",1,0)","v":1},null,{"$f":"IF(Q4<>\"\",1,0)+IF(Q5<>\"\",1,0)+IF(Q6<>\"\",1,0)+IF(Q7<>\"\",1,0)+IF(Q8<>\"\",1,0)+IF(Q9<>\"\",1,0)+IF(Q10<>\"\",1,0)+IF(Q11<>\"\",1,0)+IF(Q12<>\"\",1,0)+IF(Q13<>\"\",1,0)+IF(Q14<>\"\",1,0)+IF(Q15<>\"\",1,0)+IF(Q16<>\"\",1,0)","v":0},null,{"$f":"IF(S4<>\"\",1,0)+IF(S5<>\"\",1,0)+IF(S6<>\"\",1,0)+IF(S7<>\"\",1,0)+IF(S8<>\"\",1,0)+IF(S9<>\"\",1,0)+IF(S10<>\"\",1,0)+IF(S11<>\"\",1,0)+IF(S12<>\"\",1,0)+IF(S13<>\"\",1,0)+IF(S14<>\"\",1,0)+IF(S15<>\"\",1,0)+IF(S16<>\"\",1,0)","v":1},null,{"$f":"IF(U4<>\"\",1,0)+IF(U5<>\"\",1,0)+IF(U6<>\"\",1,0)+IF(U7<>\"\",1,0)+IF(U8<>\"\",1,0)+IF(U9<>\"\",1,0)+IF(U10<>\"\",1,0)+IF(U11<>\"\",1,0)+IF(U12<>\"\",1,0)+IF(U13<>\"\",1,0)+IF(U14<>\"\",1,0)+IF(U15<>\"\",1,0)+IF(U16<>\"\",1,0)","v":1},null,{"$f":"IF(W4<>\"\",1,0)+IF(W5<>\"\",1,0)+IF(W6<>\"\",1,0)+IF(W7<>\"\",1,0)+IF(W8<>\"\",1,0)+IF(W9<>\"\",1,0)+IF(W10<>\"\",1,0)+IF(W11<>\"\",1,0)+IF(W12<>\"\",1,0)+IF(W13<>\"\",1,0)+IF(W14<>\"\",1,0)+IF(W15<>\"\",1,0)+IF(W16<>\"\",1,0)","v":0},null,{"$f":"IF(Y4<>\"\",1,0)+IF(Y5<>\"\",1,0)+IF(Y6<>\"\",1,0)+IF(Y7<>\"\",1,0)+IF(Y8<>\"\",1,0)+IF(Y9<>\"\",1,0)+IF(Y10<>\"\",1,0)+IF(Y11<>\"\",1,0)+IF(Y12<>\"\",1,0)+IF(Y13<>\"\",1,0)+IF(Y14<>\"\",1,0)+IF(Y15<>\"\",1,0)+IF(Y16<>\"\",1,0)","v":0},null,{"$f":"IF(AA4<>\"\",1,0)+IF(AA5<>\"\",1,0)+IF(AA6<>\"\",1,0)+IF(AA7<>\"\",1,0)+IF(AA8<>\"\",1,0)+IF(AA9<>\"\",1,0)+IF(AA10<>\"\",1,0)+IF(AA11<>\"\",1,0)+IF(AA12<>\"\",1,0)+IF(AA13<>\"\",1,0)+IF(AA14<>\"\",1,0)+IF(AA15<>\"\",1,0)+IF(AA16<>\"\",1,0)","v":0},{"$f":"IF(B22<>\"\",\"OTOČ !!!\",\"\")","v":""},null,null,null,null,false]
[null,null,null,null,null,null,null,null,null,null,null,null,null,null,null,null,null,null,null,null,null,null,null," "]
[null,"Rozpis věcí na:",null,null,{"$f":"E1","v":"Bazen Kralupy"},null,null,null,null,null,null,null,null,null,null,null,{"$f":"Q1","v":"2023-09-12"},null,null,null,null,null,"BAZEN",null,null,null,"VOLNA VODA"]
[null,"Nářadí     O2     podložka…",null,null,"Láhev velikost",null,"Pásek","Olovo počet ks",null,"BCD (vel./čís.)  i - integr",null,"reg (číslo)",null,"Velikost a číslo",null,null,"rukavice",null,"maska",null,"ploutve       s - SPLIT",null,"botky           o - old",null,"počítač",null,"světlo         l - lumen",null,"Dopr. KM","Počet dní","Cena  baz","Ostatní"]
["Datum zápisu","Jméno a příjmení","Kontakt / důvod","Kč",null,null,null,null,null,null,null,null,null,"oblek dlouhý","oblek short"]
[{"$f":"TODAY()","v":"2023-09-14"},null,null,{"$f":"(IF(AG22,(F22+I22+K22+M22+P22+R22+T22+V22+X22+Z22+AB22)*(1-'Půjčovna ALEA'!$E$38),F22+I22+K22+M22+P22+R22+T22+V22+X22+Z22+AB22)+IF(ISNUMBER(VALUE(AE22)),AE22,0)+'formulář půjčovna'!$G$46*IF(ISNUMBER(VALUE(AC22)),AC22,0))*IF(AND(ISNUMBER(VALUE(AD22)),AD22>0),AD22,1)","v":0},null,{"$f":"IF(E22<>\"\",IF(ISNUMBER(VALUE(E22)),'Půjčovna ALEA'!C$13+(E22*'Půjčovna ALEA'!C$33),('Půjčovna ALEA'!C$13+(10*'Půjčovna ALEA'!C$33))),0)","v":0},null,null,{"$f":"IF((G22<>\"\"),'Půjčovna ALEA'!C$21,0)+(IF((H22<>\"\"),IF(ISNUMBER(VALUE(H22)),('Půjčovna ALEA'!C$22*H22),(('Půjčovna ALEA'!C$22)*6)),0))","v":0},null,{"$f":"IF((J22<>\"\"),IF((LEFT(J22,3)=\"tec\"),'Půjčovna ALEA'!C$15,'Půjčovna ALEA'!C$13),0)","v":0},null,{"$f":"IF((L22<>\"\"),'Půjčovna ALEA'!C$18,0)","v":0},null,null,{"$f":"IF((N22<>\"\"),IF((LEFT(N22,1)=\"o\"),'Půjčovna ALEA'!C$16,'Půjčovna ALEA'!C$17),0)+IF((O22<>\"\"),IF((LEFT(O22,1)=\"o\"),'Půjčovna ALEA'!C$16,'Půjčovna ALEA'!C$17),0)","v":0},null,{"$f":"IF((Q22<>\"\"),'Půjčovna ALEA'!C$30,0)","v":0},null,{"$f":"IF((S22<>\"\"),'Půjčovna ALEA'!C$28,0)","v":0},null,{"$f":"IF((U22<>\"\"),IF((LEFT(U22,1)=\"s\"),'Půjčovna ALEA'!C$26,'Půjčovna ALEA'!C$27),0)","v":0},null,{"$f":"IF((W22<>\"\"),IF((LEFT(W22,1)=\"o\"),'Půjčovna ALEA'!C$29,'Půjčovna ALEA'!C$25),0)","v":0},null,{"$f":"IF((Y22<>\"\"),'Půjčovna ALEA'!C$23,0)","v":0},null,{"$f":"IF((AA22<>\"\"),IF((LEFT(AA22,1)=\"l\"),'Půjčovna ALEA'!C$19,'Půjčovna ALEA'!C$20),0)","v":0}]
[null,null,null,{"$f":"(IF(AG23,(F23+I23+K23+M23+P23+R23+T23+V23+X23+Z23+AB23)*(1-'Půjčovna ALEA'!$E$38),F23+I23+K23+M23+P23+R23+T23+V23+X23+Z23+AB23)+IF(ISNUMBER(VALUE(AE23)),AE23,0)+'formulář půjčovna'!$G$46*IF(ISNUMBER(VALUE(AC23)),AC23,0))*IF(AND(ISNUMBER(VALUE(AD23)),AD23>0),AD23,1)","v":0},null,{"$f":"IF(E23<>\"\",IF(ISNUMBER(VALUE(E23)),'Půjčovna ALEA'!C$13+(E23*'Půjčovna ALEA'!C$33),('Půjčovna ALEA'!C$13+(10*'Půjčovna ALEA'!C$33))),0)","v":0},null,null,{"$f":"IF((G23<>\"\"),'Půjčovna ALEA'!C$21,0)+(IF((H23<>\"\"),IF(ISNUMBER(VALUE(H23)),('Půjčovna ALEA'!C$22*H23),(('Půjčovna ALEA'!C$22)*6)),0))","v":0},null,{"$f":"IF((J23<>\"\"),IF((LEFT(J23,3)=\"tec\"),'Půjčovna ALEA'!C$15,'Půjčovna ALEA'!C$13),0)","v":0},null,{"$f":"IF((L23<>\"\"),'Půjčovna ALEA'!C$18,0)","v":0},null,null,{"$f":"IF((N23<>\"\"),IF((LEFT(N23,1)=\"o\"),'Půjčovna ALEA'!C$16,'Půjčovna ALEA'!C$17),0)+IF((O23<>\"\"),IF((LEFT(O23,1)=\"o\"),'Půjčovna ALEA'!C$16,'Půjčovna ALEA'!C$17),0)","v":0},null,{"$f":"IF((Q23<>\"\"),'Půjčovna ALEA'!C$30,0)","v":0},null,{"$f":"IF((S23<>\"\"),'Půjčovna ALEA'!C$28,0)","v":0},null,{"$f":"IF((U23<>\"\"),IF((LEFT(U23,1)=\"s\"),'Půjčovna ALEA'!C$26,'Půjčovna ALEA'!C$27),0)","v":0},null,{"$f":"IF((W23<>\"\"),IF((LEFT(W23,1)=\"o\"),'Půjčovna ALEA'!C$29,'Půjčovna ALEA'!C$25),0)","v":0},null,{"$f":"IF((Y23<>\"\"),'Půjčovna ALEA'!C$23,0)","v":0},null,{"$f":"IF((AA23<>\"\"),IF((LEFT(AA23,1)=\"l\"),'Půjčovna ALEA'!C$19,'Půjčovna ALEA'!C$20),0)","v":0}]
[15,null,null,{"$f":"(IF(AG24,(F24+I24+K24+M24+P24+R24+T24+V24+X24+Z24+AB24)*(1-'Půjčovna ALEA'!$E$38),F24+I24+K24+M24+P24+R24+T24+V24+X24+Z24+AB24)+IF(ISNUMBER(VALUE(AE24)),AE24,0)+'formulář půjčovna'!$G$46*IF(ISNUMBER(VALUE(AC24)),AC24,0))*IF(AND(ISNUMBER(VALUE(AD24)),AD24>0),AD24,1)","v":0},null,{"$f":"IF(E24<>\"\",IF(ISNUMBER(VALUE(E24)),'Půjčovna ALEA'!C$13+(E24*'Půjčovna ALEA'!C$33),('Půjčovna ALEA'!C$13+(10*'Půjčovna ALEA'!C$33))),0)","v":0},null,null,{"$f":"IF((G24<>\"\"),'Půjčovna ALEA'!C$21,0)+(IF((H24<>\"\"),IF(ISNUMBER(VALUE(H24)),('Půjčovna ALEA'!C$22*H24),(('Půjčovna ALEA'!C$22)*6)),0))","v":0},null,{"$f":"IF((J24<>\"\"),IF((LEFT(J24,3)=\"tec\"),'Půjčovna ALEA'!C$15,'Půjčovna ALEA'!C$13),0)","v":0},null,{"$f":"IF((L24<>\"\"),'Půjčovna ALEA'!C$18,0)","v":0},null,null,{"$f":"IF((N24<>\"\"),IF((LEFT(N24,1)=\"o\"),'Půjčovna ALEA'!C$16,'Půjčovna ALEA'!C$17),0)+IF((O24<>\"\"),IF((LEFT(O24,1)=\"o\"),'Půjčovna ALEA'!C$16,'Půjčovna ALEA'!C$17),0)","v":0},null,{"$f":"IF((Q24<>\"\"),'Půjčovna ALEA'!C$30,0)","v":0},null,{"$f":"IF((S24<>\"\"),'Půjčovna ALEA'!C$28,0)","v":0},null,{"$f":"IF((U24<>\"\"),IF((LEFT(U24,1)=\"s\"),'Půjčovna ALEA'!C$26,'Půjčovna ALEA'!C$27),0)","v":0},null,{"$f":"IF((W24<>\"\"),IF((LEFT(W24,1)=\"o\"),'Půjčovna ALEA'!C$29,'Půjčovna ALEA'!C$25),0)","v":0},null,{"$f":"IF((Y24<>\"\"),'Půjčovna ALEA'!C$23,0)","v":0},null,{"$f":"IF((AA24<>\"\"),IF((LEFT(AA24,1)=\"l\"),'Půjčovna ALEA'!C$19,'Půjčovna ALEA'!C$20),0)","v":0}]
[16,null,null,{"$f":"(IF(AG25,(F25+I25+K25+M25+P25+R25+T25+V25+X25+Z25+AB25)*(1-'Půjčovna ALEA'!$E$38),F25+I25+K25+M25+P25+R25+T25+V25+X25+Z25+AB25)+IF(ISNUMBER(VALUE(AE25)),AE25,0)+'formulář půjčovna'!$G$46*IF(ISNUMBER(VALUE(AC25)),AC25,0))*IF(AND(ISNUMBER(VALUE(AD25)),AD25>0),AD25,1)","v":0},null,{"$f":"IF(E25<>\"\",IF(ISNUMBER(VALUE(E25)),'Půjčovna ALEA'!C$13+(E25*'Půjčovna ALEA'!C$33),('Půjčovna ALEA'!C$13+(10*'Půjčovna ALEA'!C$33))),0)","v":0},null,null,{"$f":"IF((G25<>\"\"),'Půjčovna ALEA'!C$21,0)+(IF((H25<>\"\"),IF(ISNUMBER(VALUE(H25)),('Půjčovna ALEA'!C$22*H25),(('Půjčovna ALEA'!C$22)*6)),0))","v":0},null,{"$f":"IF((J25<>\"\"),IF((LEFT(J25,3)=\"tec\"),'Půjčovna ALEA'!C$15,'Půjčovna ALEA'!C$13),0)","v":0},null,{"$f":"IF((L25<>\"\"),'Půjčovna ALEA'!C$18,0)","v":0},null,null,{"$f":"IF((N25<>\"\"),IF((LEFT(N25,1)=\"o\"),'Půjčovna ALEA'!C$16,'Půjčovna ALEA'!C$17),0)+IF((O25<>\"\"),IF((LEFT(O25,1)=\"o\"),'Půjčovna ALEA'!C$16,'Půjčovna ALEA'!C$17),0)","v":0},null,{"$f":"IF((Q25<>\"\"),'Půjčovna ALEA'!C$30,0)","v":0},null,{"$f":"IF((S25<>\"\"),'Půjčovna ALEA'!C$28,0)","v":0},null,{"$f":"IF((U25<>\"\"),IF((LEFT(U25,1)=\"s\"),'Půjčovna ALEA'!C$26,'Půjčovna ALEA'!C$27),0)","v":0},null,{"$f":"IF((W25<>\"\"),IF((LEFT(W25,1)=\"o\"),'Půjčovna ALEA'!C$29,'Půjčovna ALEA'!C$25),0)","v":0},null,{"$f":"IF((Y25<>\"\"),'Půjčovna ALEA'!C$23,0)","v":0},null,{"$f":"IF((AA25<>\"\"),IF((LEFT(AA25,1)=\"l\"),'Půjčovna ALEA'!C$19,'Půjčovna ALEA'!C$20),0)","v":0}]
[17,null,null,{"$f":"(IF(AG26,(F26+I26+K26+M26+P26+R26+T26+V26+X26+Z26+AB26)*(1-'Půjčovna ALEA'!$E$38),F26+I26+K26+M26+P26+R26+T26+V26+X26+Z26+AB26)+IF(ISNUMBER(VALUE(AE26)),AE26,0)+'formulář půjčovna'!$G$46*IF(ISNUMBER(VALUE(AC26)),AC26,0))*IF(AND(ISNUMBER(VALUE(AD26)),AD26>0),AD26,1)","v":0},null,{"$f":"IF(E26<>\"\",IF(ISNUMBER(VALUE(E26)),'Půjčovna ALEA'!C$13+(E26*'Půjčovna ALEA'!C$33),('Půjčovna ALEA'!C$13+(10*'Půjčovna ALEA'!C$33))),0)","v":0},null,null,{"$f":"IF((G26<>\"\"),'Půjčovna ALEA'!C$21,0)+(IF((H26<>\"\"),IF(ISNUMBER(VALUE(H26)),('Půjčovna ALEA'!C$22*H26),(('Půjčovna ALEA'!C$22)*6)),0))","v":0},null,{"$f":"IF((J26<>\"\"),IF((LEFT(J26,3)=\"tec\"),'Půjčovna ALEA'!C$15,'Půjčovna ALEA'!C$13),0)","v":0},null,{"$f":"IF((L26<>\"\"),'Půjčovna ALEA'!C$18,0)","v":0},null,null,{"$f":"IF((N26<>\"\"),IF((LEFT(N26,1)=\"o\"),'Půjčovna ALEA'!C$16,'Půjčovna ALEA'!C$17),0)+IF((O26<>\"\"),IF((LEFT(O26,1)=\"o\"),'Půjčovna ALEA'!C$16,'Půjčovna ALEA'!C$17),0)","v":0},null,{"$f":"IF((Q26<>\"\"),'Půjčovna ALEA'!C$30,0)","v":0},null,{"$f":"IF((S26<>\"\"),'Půjčovna ALEA'!C$28,0)","v":0},null,{"$f":"IF((U26<>\"\"),IF((LEFT(U26,1)=\"s\"),'Půjčovna ALEA'!C$26,'Půjčovna ALEA'!C$27),0)","v":0},null,{"$f":"IF((W26<>\"\"),IF((LEFT(W26,1)=\"o\"),'Půjčovna ALEA'!C$29,'Půjčovna ALEA'!C$25),0)","v":0},null,{"$f":"IF((Y26<>\"\"),'Půjčovna ALEA'!C$23,0)","v":0},null,{"$f":"IF((AA26<>\"\"),IF((LEFT(AA26,1)=\"l\"),'Půjčovna ALEA'!C$19,'Půjčovna ALEA'!C$20),0)","v":0}]
[18,null,null,{"$f":"(IF(AG27,(F27+I27+K27+M27+P27+R27+T27+V27+X27+Z27+AB27)*(1-'Půjčovna ALEA'!$E$38),F27+I27+K27+M27+P27+R27+T27+V27+X27+Z27+AB27)+IF(ISNUMBER(VALUE(AE27)),AE27,0)+'formulář půjčovna'!$G$46*IF(ISNUMBER(VALUE(AC27)),AC27,0))*IF(AND(ISNUMBER(VALUE(AD27)),AD27>0),AD27,1)","v":0},null,{"$f":"IF(E27<>\"\",IF(ISNUMBER(VALUE(E27)),'Půjčovna ALEA'!C$13+(E27*'Půjčovna ALEA'!C$33),('Půjčovna ALEA'!C$13+(10*'Půjčovna ALEA'!C$33))),0)","v":0},null,null,{"$f":"IF((G27<>\"\"),'Půjčovna ALEA'!C$21,0)+(IF((H27<>\"\"),IF(ISNUMBER(VALUE(H27)),('Půjčovna ALEA'!C$22*H27),(('Půjčovna ALEA'!C$22)*6)),0))","v":0},null,{"$f":"IF((J27<>\"\"),IF((LEFT(J27,3)=\"tec\"),'Půjčovna ALEA'!C$15,'Půjčovna ALEA'!C$13),0)","v":0},null,{"$f":"IF((L27<>\"\"),'Půjčovna ALEA'!C$18,0)","v":0},null,null,{"$f":"IF((N27<>\"\"),IF((LEFT(N27,1)=\"o\"),'Půjčovna ALEA'!C$16,'Půjčovna ALEA'!C$17),0)+IF((O27<>\"\"),IF((LEFT(O27,1)=\"o\"),'Půjčovna ALEA'!C$16,'Půjčovna ALEA'!C$17),0)","v":0},null,{"$f":"IF((Q27<>\"\"),'Půjčovna ALEA'!C$30,0)","v":0},null,{"$f":"IF((S27<>\"\"),'Půjčovna ALEA'!C$28,0)","v":0},null,{"$f":"IF((U27<>\"\"),IF((LEFT(U27,1)=\"s\"),'Půjčovna ALEA'!C$26,'Půjčovna ALEA'!C$27),0)","v":0},null,{"$f":"IF((W27<>\"\"),IF((LEFT(W27,1)=\"o\"),'Půjčovna ALEA'!C$29,'Půjčovna ALEA'!C$25),0)","v":0},null,{"$f":"IF((Y27<>\"\"),'Půjčovna ALEA'!C$23,0)","v":0},null,{"$f":"IF((AA27<>\"\"),IF((LEFT(AA27,1)=\"l\"),'Půjčovna ALEA'!C$19,'Půjčovna ALEA'!C$20),0)","v":0}]
[19,null,null,{"$f":"(IF(AG28,(F28+I28+K28+M28+P28+R28+T28+V28+X28+Z28+AB28)*(1-'Půjčovna ALEA'!$E$38),F28+I28+K28+M28+P28+R28+T28+V28+X28+Z28+AB28)+IF(ISNUMBER(VALUE(AE28)),AE28,0)+'formulář půjčovna'!$G$46*IF(ISNUMBER(VALUE(AC28)),AC28,0))*IF(AND(ISNUMBER(VALUE(AD28)),AD28>0),AD28,1)","v":0},null,{"$f":"IF(E28<>\"\",IF(ISNUMBER(VALUE(E28)),'Půjčovna ALEA'!C$13+(E28*'Půjčovna ALEA'!C$33),('Půjčovna ALEA'!C$13+(10*'Půjčovna ALEA'!C$33))),0)","v":0},null,null,{"$f":"IF((G28<>\"\"),'Půjčovna ALEA'!C$21,0)+(IF((H28<>\"\"),IF(ISNUMBER(VALUE(H28)),('Půjčovna ALEA'!C$22*H28),(('Půjčovna ALEA'!C$22)*6)),0))","v":0},null,{"$f":"IF((J28<>\"\"),IF((LEFT(J28,3)=\"tec\"),'Půjčovna ALEA'!C$15,'Půjčovna ALEA'!C$13),0)","v":0},null,{"$f":"IF((L28<>\"\"),'Půjčovna ALEA'!C$18,0)","v":0},null,null,{"$f":"IF((N28<>\"\"),IF((LEFT(N28,1)=\"o\"),'Půjčovna ALEA'!C$16,'Půjčovna ALEA'!C$17),0)+IF((O28<>\"\"),IF((LEFT(O28,1)=\"o\"),'Půjčovna ALEA'!C$16,'Půjčovna ALEA'!C$17),0)","v":0},null,{"$f":"IF((Q28<>\"\"),'Půjčovna ALEA'!C$30,0)","v":0},null,{"$f":"IF((S28<>\"\"),'Půjčovna ALEA'!C$28,0)","v":0},null,{"$f":"IF((U28<>\"\"),IF((LEFT(U28,1)=\"s\"),'Půjčovna ALEA'!C$26,'Půjčovna ALEA'!C$27),0)","v":0},null,{"$f":"IF((W28<>\"\"),IF((LEFT(W28,1)=\"o\"),'Půjčovna ALEA'!C$29,'Půjčovna ALEA'!C$25),0)","v":0},null,{"$f":"IF((Y28<>\"\"),'Půjčovna ALEA'!C$23,0)","v":0},null,{"$f":"IF((AA28<>\"\"),IF((LEFT(AA28,1)=\"l\"),'Půjčovna ALEA'!C$19,'Půjčovna ALEA'!C$20),0)","v":0}]
[20,null,null,{"$f":"(IF(AG29,(F29+I29+K29+M29+P29+R29+T29+V29+X29+Z29+AB29)*(1-'Půjčovna ALEA'!$E$38),F29+I29+K29+M29+P29+R29+T29+V29+X29+Z29+AB29)+IF(ISNUMBER(VALUE(AE29)),AE29,0)+'formulář půjčovna'!$G$46*IF(ISNUMBER(VALUE(AC29)),AC29,0))*IF(AND(ISNUMBER(VALUE(AD29)),AD29>0),AD29,1)","v":0},null,{"$f":"IF(E29<>\"\",IF(ISNUMBER(VALUE(E29)),'Půjčovna ALEA'!C$13+(E29*'Půjčovna ALEA'!C$33),('Půjčovna ALEA'!C$13+(10*'Půjčovna ALEA'!C$33))),0)","v":0},null,null,{"$f":"IF((G29<>\"\"),'Půjčovna ALEA'!C$21,0)+(IF((H29<>\"\"),IF(ISNUMBER(VALUE(H29)),('Půjčovna ALEA'!C$22*H29),(('Půjčovna ALEA'!C$22)*6)),0))","v":0},null,{"$f":"IF((J29<>\"\"),IF((LEFT(J29,3)=\"tec\"),'Půjčovna ALEA'!C$15,'Půjčovna ALEA'!C$13),0)","v":0},null,{"$f":"IF((L29<>\"\"),'Půjčovna ALEA'!C$18,0)","v":0},null,null,{"$f":"IF((N29<>\"\"),IF((LEFT(N29,1)=\"o\"),'Půjčovna ALEA'!C$16,'Půjčovna ALEA'!C$17),0)+IF((O29<>\"\"),IF((LEFT(O29,1)=\"o\"),'Půjčovna ALEA'!C$16,'Půjčovna ALEA'!C$17),0)","v":0},null,{"$f":"IF((Q29<>\"\"),'Půjčovna ALEA'!C$30,0)","v":0},null,{"$f":"IF((S29<>\"\"),'Půjčovna ALEA'!C$28,0)","v":0},null,{"$f":"IF((U29<>\"\"),IF((LEFT(U29,1)=\"s\"),'Půjčovna ALEA'!C$26,'Půjčovna ALEA'!C$27),0)","v":0},null,{"$f":"IF((W29<>\"\"),IF((LEFT(W29,1)=\"o\"),'Půjčovna ALEA'!C$29,'Půjčovna ALEA'!C$25),0)","v":0},null,{"$f":"IF((Y29<>\"\"),'Půjčovna ALEA'!C$23,0)","v":0},null,{"$f":"IF((AA29<>\"\"),IF((LEFT(AA29,1)=\"l\"),'Půjčovna ALEA'!C$19,'Půjčovna ALEA'!C$20),0)","v":0}]
[21,null,null,{"$f":"(IF(AG30,(F30+I30+K30+M30+P30+R30+T30+V30+X30+Z30+AB30)*(1-'Půjčovna ALEA'!$E$38),F30+I30+K30+M30+P30+R30+T30+V30+X30+Z30+AB30)+IF(ISNUMBER(VALUE(AE30)),AE30,0)+'formulář půjčovna'!$G$46*IF(ISNUMBER(VALUE(AC30)),AC30,0))*IF(AND(ISNUMBER(VALUE(AD30)),AD30>0),AD30,1)","v":0},null,{"$f":"IF(E30<>\"\",IF(ISNUMBER(VALUE(E30)),'Půjčovna ALEA'!C$13+(E30*'Půjčovna ALEA'!C$33),('Půjčovna ALEA'!C$13+(10*'Půjčovna ALEA'!C$33))),0)","v":0},null,null,{"$f":"IF((G30<>\"\"),'Půjčovna ALEA'!C$21,0)+(IF((H30<>\"\"),IF(ISNUMBER(VALUE(H30)),('Půjčovna ALEA'!C$22*H30),(('Půjčovna ALEA'!C$22)*6)),0))","v":0},null,{"$f":"IF((J30<>\"\"),IF((LEFT(J30,3)=\"tec\"),'Půjčovna ALEA'!C$15,'Půjčovna ALEA'!C$13),0)","v":0},null,{"$f":"IF((L30<>\"\"),'Půjčovna ALEA'!C$18,0)","v":0},null,null,{"$f":"IF((N30<>\"\"),IF((LEFT(N30,1)=\"o\"),'Půjčovna ALEA'!C$16,'Půjčovna ALEA'!C$17),0)+IF((O30<>\"\"),IF((LEFT(O30,1)=\"o\"),'Půjčovna ALEA'!C$16,'Půjčovna ALEA'!C$17),0)","v":0},null,{"$f":"IF((Q30<>\"\"),'Půjčovna ALEA'!C$30,0)","v":0},null,{"$f":"IF((S30<>\"\"),'Půjčovna ALEA'!C$28,0)","v":0},null,{"$f":"IF((U30<>\"\"),IF((LEFT(U30,1)=\"s\"),'Půjčovna ALEA'!C$26,'Půjčovna ALEA'!C$27),0)","v":0},null,{"$f":"IF((W30<>\"\"),IF((LEFT(W30,1)=\"o\"),'Půjčovna ALEA'!C$29,'Půjčovna ALEA'!C$25),0)","v":0},null,{"$f":"IF((Y30<>\"\"),'Půjčovna ALEA'!C$23,0)","v":0},null,{"$f":"IF((AA30<>\"\"),IF((LEFT(AA30,1)=\"l\"),'Půjčovna ALEA'!C$19,'Půjčovna ALEA'!C$20),0)","v":0}]
[22,null,null,{"$f":"(IF(AG31,(F31+I31+K31+M31+P31+R31+T31+V31+X31+Z31+AB31)*(1-'Půjčovna ALEA'!$E$38),F31+I31+K31+M31+P31+R31+T31+V31+X31+Z31+AB31)+IF(ISNUMBER(VALUE(AE31)),AE31,0)+'formulář půjčovna'!$G$46*IF(ISNUMBER(VALUE(AC31)),AC31,0))*IF(AND(ISNUMBER(VALUE(AD31)),AD31>0),AD31,1)","v":0},null,{"$f":"IF(E31<>\"\",IF(ISNUMBER(VALUE(E31)),'Půjčovna ALEA'!C$13+(E31*'Půjčovna ALEA'!C$33),('Půjčovna ALEA'!C$13+(10*'Půjčovna ALEA'!C$33))),0)","v":0},null,null,{"$f":"IF((G31<>\"\"),'Půjčovna ALEA'!C$21,0)+(IF((H31<>\"\"),IF(ISNUMBER(VALUE(H31)),('Půjčovna ALEA'!C$22*H31),(('Půjčovna ALEA'!C$22)*6)),0))","v":0},null,{"$f":"IF((J31<>\"\"),IF((LEFT(J31,3)=\"tec\"),'Půjčovna ALEA'!C$15,'Půjčovna ALEA'!C$13),0)","v":0},null,{"$f":"IF((L31<>\"\"),'Půjčovna ALEA'!C$18,0)","v":0},null,null,{"$f":"IF((N31<>\"\"),IF((LEFT(N31,1)=\"o\"),'Půjčovna ALEA'!C$16,'Půjčovna ALEA'!C$17),0)+IF((O31<>\"\"),IF((LEFT(O31,1)=\"o\"),'Půjčovna ALEA'!C$16,'Půjčovna ALEA'!C$17),0)","v":0},null,{"$f":"IF((Q31<>\"\"),'Půjčovna ALEA'!C$30,0)","v":0},null,{"$f":"IF((S31<>\"\"),'Půjčovna ALEA'!C$28,0)","v":0},null,{"$f":"IF((U31<>\"\"),IF((LEFT(U31,1)=\"s\"),'Půjčovna ALEA'!C$26,'Půjčovna ALEA'!C$27),0)","v":0},null,{"$f":"IF((W31<>\"\"),IF((LEFT(W31,1)=\"o\"),'Půjčovna ALEA'!C$29,'Půjčovna ALEA'!C$25),0)","v":0},null,{"$f":"IF((Y31<>\"\"),'Půjčovna ALEA'!C$23,0)","v":0},null,{"$f":"IF((AA31<>\"\"),IF((LEFT(AA31,1)=\"l\"),'Půjčovna ALEA'!C$19,'Půjčovna ALEA'!C$20),0)","v":0}]
[23,null,null,{"$f":"(IF(AG32,(F32+I32+K32+M32+P32+R32+T32+V32+X32+Z32+AB32)*(1-'Půjčovna ALEA'!$E$38),F32+I32+K32+M32+P32+R32+T32+V32+X32+Z32+AB32)+IF(ISNUMBER(VALUE(AE32)),AE32,0)+'formulář půjčovna'!$G$46*IF(ISNUMBER(VALUE(AC32)),AC32,0))*IF(AND(ISNUMBER(VALUE(AD32)),AD32>0),AD32,1)","v":0},null,{"$f":"IF(E32<>\"\",IF(ISNUMBER(VALUE(E32)),'Půjčovna ALEA'!C$13+(E32*'Půjčovna ALEA'!C$33),('Půjčovna ALEA'!C$13+(10*'Půjčovna ALEA'!C$33))),0)","v":0},null,null,{"$f":"IF((G32<>\"\"),'Půjčovna ALEA'!C$21,0)+(IF((H32<>\"\"),IF(ISNUMBER(VALUE(H32)),('Půjčovna ALEA'!C$22*H32),(('Půjčovna ALEA'!C$22)*6)),0))","v":0},null,{"$f":"IF((J32<>\"\"),IF((LEFT(J32,3)=\"tec\"),'Půjčovna ALEA'!C$15,'Půjčovna ALEA'!C$13),0)","v":0},null,{"$f":"IF((L32<>\"\"),'Půjčovna ALEA'!C$18,0)","v":0},null,null,{"$f":"IF((N32<>\"\"),IF((LEFT(N32,1)=\"o\"),'Půjčovna ALEA'!C$16,'Půjčovna ALEA'!C$17),0)+IF((O32<>\"\"),IF((LEFT(O32,1)=\"o\"),'Půjčovna ALEA'!C$16,'Půjčovna ALEA'!C$17),0)","v":0},null,{"$f":"IF((Q32<>\"\"),'Půjčovna ALEA'!C$30,0)","v":0},null,{"$f":"IF((S32<>\"\"),'Půjčovna ALEA'!C$28,0)","v":0},null,{"$f":"IF((U32<>\"\"),IF((LEFT(U32,1)=\"s\"),'Půjčovna ALEA'!C$26,'Půjčovna ALEA'!C$27),0)","v":0},null,{"$f":"IF((W32<>\"\"),IF((LEFT(W32,1)=\"o\"),'Půjčovna ALEA'!C$29,'Půjčovna ALEA'!C$25),0)","v":0},null,{"$f":"IF((Y32<>\"\"),'Půjčovna ALEA'!C$23,0)","v":0},null,{"$f":"IF((AA32<>\"\"),IF((LEFT(AA32,1)=\"l\"),'Půjčovna ALEA'!C$19,'Půjčovna ALEA'!C$20),0)","v":0}]
[24,null,null,{"$f":"(IF(AG33,(F33+I33+K33+M33+P33+R33+T33+V33+X33+Z33+AB33)*(1-'Půjčovna ALEA'!$E$38),F33+I33+K33+M33+P33+R33+T33+V33+X33+Z33+AB33)+IF(ISNUMBER(VALUE(AE33)),AE33,0)+'formulář půjčovna'!$G$46*IF(ISNUMBER(VALUE(AC33)),AC33,0))*IF(AND(ISNUMBER(VALUE(AD33)),AD33>0),AD33,1)","v":0},null,{"$f":"IF(E33<>\"\",IF(ISNUMBER(VALUE(E33)),'Půjčovna ALEA'!C$13+(E33*'Půjčovna ALEA'!C$33),('Půjčovna ALEA'!C$13+(10*'Půjčovna ALEA'!C$33))),0)","v":0},null,null,{"$f":"IF((G33<>\"\"),'Půjčovna ALEA'!C$21,0)+(IF((H33<>\"\"),IF(ISNUMBER(VALUE(H33)),('Půjčovna ALEA'!C$22*H33),(('Půjčovna ALEA'!C$22)*6)),0))","v":0},null,{"$f":"IF((J33<>\"\"),IF((LEFT(J33,3)=\"tec\"),'Půjčovna ALEA'!C$15,'Půjčovna ALEA'!C$13),0)","v":0},null,{"$f":"IF((L33<>\"\"),'Půjčovna ALEA'!C$18,0)","v":0},null,null,{"$f":"IF((N33<>\"\"),IF((LEFT(N33,1)=\"o\"),'Půjčovna ALEA'!C$16,'Půjčovna ALEA'!C$17),0)+IF((O33<>\"\"),IF((LEFT(O33,1)=\"o\"),'Půjčovna ALEA'!C$16,'Půjčovna ALEA'!C$17),0)","v":0},null,{"$f":"IF((Q33<>\"\"),'Půjčovna ALEA'!C$30,0)","v":0},null,{"$f":"IF((S33<>\"\"),'Půjčovna ALEA'!C$28,0)","v":0},null,{"$f":"IF((U33<>\"\"),IF((LEFT(U33,1)=\"s\"),'Půjčovna ALEA'!C$26,'Půjčovna ALEA'!C$27),0)","v":0},null,{"$f":"IF((W33<>\"\"),IF((LEFT(W33,1)=\"o\"),'Půjčovna ALEA'!C$29,'Půjčovna ALEA'!C$25),0)","v":0},null,{"$f":"IF((Y33<>\"\"),'Půjčovna ALEA'!C$23,0)","v":0},null,{"$f":"IF((AA33<>\"\"),IF((LEFT(AA33,1)=\"l\"),'Půjčovna ALEA'!C$19,'Půjčovna ALEA'!C$20),0)","v":0}]
[25,null,null,{"$f":"(IF(AG34,(F34+I34+K34+M34+P34+R34+T34+V34+X34+Z34+AB34)*(1-'Půjčovna ALEA'!$E$38),F34+I34+K34+M34+P34+R34+T34+V34+X34+Z34+AB34)+IF(ISNUMBER(VALUE(AE34)),AE34,0)+'formulář půjčovna'!$G$46*IF(ISNUMBER(VALUE(AC34)),AC34,0))*IF(AND(ISNUMBER(VALUE(AD34)),AD34>0),AD34,1)","v":0},null,{"$f":"IF(E34<>\"\",IF(ISNUMBER(VALUE(E34)),'Půjčovna ALEA'!C$13+(E34*'Půjčovna ALEA'!C$33),('Půjčovna ALEA'!C$13+(10*'Půjčovna ALEA'!C$33))),0)","v":0},null,null,{"$f":"IF((G34<>\"\"),'Půjčovna ALEA'!C$21,0)+(IF((H34<>\"\"),IF(ISNUMBER(VALUE(H34)),('Půjčovna ALEA'!C$22*H34),(('Půjčovna ALEA'!C$22)*6)),0))","v":0},null,{"$f":"IF((J34<>\"\"),IF((LEFT(J34,3)=\"tec\"),'Půjčovna ALEA'!C$15,'Půjčovna ALEA'!C$13),0)","v":0},null,{"$f":"IF((L34<>\"\"),'Půjčovna ALEA'!C$18,0)","v":0},null,null,{"$f":"IF((N34<>\"\"),IF((LEFT(N34,1)=\"o\"),'Půjčovna ALEA'!C$16,'Půjčovna ALEA'!C$17),0)+IF((O34<>\"\"),IF((LEFT(O34,1)=\"o\"),'Půjčovna ALEA'!C$16,'Půjčovna ALEA'!C$17),0)","v":0},null,{"$f":"IF((Q34<>\"\"),'Půjčovna ALEA'!C$30,0)","v":0},null,{"$f":"IF((S34<>\"\"),'Půjčovna ALEA'!C$28,0)","v":0},null,{"$f":"IF((U34<>\"\"),IF((LEFT(U34,1)=\"s\"),'Půjčovna ALEA'!C$26,'Půjčovna ALEA'!C$27),0)","v":0},null,{"$f":"IF((W34<>\"\"),IF((LEFT(W34,1)=\"o\"),'Půjčovna ALEA'!C$29,'Půjčovna ALEA'!C$25),0)","v":0},null,{"$f":"IF((Y34<>\"\"),'Půjčovna ALEA'!C$23,0)","v":0},null,{"$f":"IF((AA34<>\"\"),IF((LEFT(AA34,1)=\"l\"),'Půjčovna ALEA'!C$19,'Půjčovna ALEA'!C$20),0)","v":0}]
["Počty výstrojí   ",null,null,null,{"$f":"IF(E22<>\"\",1,0)+IF(E23<>\"\",1,0)+IF(E24<>\"\",1,0)+IF(E25<>\"\",1,0)+IF(E26<>\"\",1,0)+IF(E27<>\"\",1,0)+IF(E28<>\"\",1,0)+IF(E29<>\"\",1,0)+IF(E30<>\"\",1,0)+IF(E31<>\"\",1,0)+IF(E32<>\"\",1,0)+IF(E33<>\"\",1,0)+IF(E34<>\"\",1,0)","v":0},null,{"$f":"IF(G22<>\"\",1,0)+IF(G23<>\"\",1,0)+IF(G24<>\"\",1,0)+IF(G25<>\"\",1,0)+IF(G26<>\"\",1,0)+IF(G27<>\"\",1,0)+IF(G28<>\"\",1,0)+IF(G29<>\"\",1,0)+IF(G30<>\"\",1,0)+IF(G31<>\"\",1,0)+IF(G32<>\"\",1,0)+IF(G33<>\"\",1,0)+IF(G34<>\"\",1,0)","v":0},{"$f":"IF(H22<>\"\",IF(H22=\" \",1,IF(H22>0,H22,1)),0)+IF(H23<>\"\",IF(H23=\" \",1,IF(H23>0,H23,1)),0)+IF(H24<>\"\",IF(H24=\" \",1,IF(H24>0,H24,1)),0)+IF(H25<>\"\",IF(H25=\" \",1,IF(H25>0,H25,1)),0)+IF(H26<>\"\",IF(H26=\" \",1,IF(H26>0,H26,1)),0)+IF(H27<>\"\",IF(H27=\" \",1,IF(H27>0,H27,1)),0)+IF(H28<>\"\",IF(H28=\" \",1,IF(H28>0,H28,1)),0)+IF(H29<>\"\",IF(H29=\" \",1,IF(H29>0,H29,1)),0)+IF(H30<>\"\",IF(H30=\" \",1,IF(H30>0,H30,1)),0)+IF(H31<>\"\",IF(H31=\" \",1,IF(H31>0,H31,1)),0)+IF(H32<>\"\",IF(H32=\" \",1,IF(H32>0,H32,1)),0)+IF(H33<>\"\",IF(H33=\" \",1,IF(H33>0,H33,1)),0)+IF(H34<>\"\",IF(H34=\" \",1,IF(H34>0,H34,1)),0)","v":0},null,{"$f":"IF(J22<>\"\",1,0)+IF(J23<>\"\",1,0)+IF(J24<>\"\",1,0)+IF(J25<>\"\",1,0)+IF(J26<>\"\",1,0)+IF(J27<>\"\",1,0)+IF(J28<>\"\",1,0)+IF(J29<>\"\",1,0)+IF(J30<>\"\",1,0)+IF(J31<>\"\",1,0)+IF(J32<>\"\",1,0)+IF(J33<>\"\",1,0)+IF(J34<>\"\",1,0)","v":0},null,{"$f":"IF(L22<>\"\",1,0)+IF(L23<>\"\",1,0)+IF(L24<>\"\",1,0)+IF(L25<>\"\",1,0)+IF(L26<>\"\",1,0)+IF(L27<>\"\",1,0)+IF(L28<>\"\",1,0)+IF(L29<>\"\",1,0)+IF(L30<>\"\",1,0)+IF(L31<>\"\",1,0)+IF(L32<>\"\",1,0)+IF(L33<>\"\",1,0)+IF(L34<>\"\",1,0)","v":0},null,{"$f":"IF(N22<>\"\",1,0)+IF(N23<>\"\",1,0)+IF(N24<>\"\",1,0)+IF(N25<>\"\",1,0)+IF(N26<>\"\",1,0)+IF(N27<>\"\",1,0)+IF(N28<>\"\",1,0)+IF(N29<>\"\",1,0)+IF(N30<>\"\",1,0)+IF(N31<>\"\",1,0)+IF(N32<>\"\",1,0)+IF(N33<>\"\",1,0)+IF(N34<>\"\",1,0)","v":0},{"$f":"IF(O22<>\"\",1,0)+IF(O23<>\"\",1,0)+IF(O24<>\"\",1,0)+IF(O25<>\"\",1,0)+IF(O26<>\"\",1,0)+IF(O27<>\"\",1,0)+IF(O28<>\"\",1,0)+IF(O29<>\"\",1,0)+IF(O30<>\"\",1,0)+IF(O31<>\"\",1,0)+IF(O32<>\"\",1,0)+IF(O33<>\"\",1,0)+IF(O34<>\"\",1,0)","v":0},null,{"$f":"IF(Q22<>\"\",1,0)+IF(Q23<>\"\",1,0)+IF(Q24<>\"\",1,0)+IF(Q25<>\"\",1,0)+IF(Q26<>\"\",1,0)+IF(Q27<>\"\",1,0)+IF(Q28<>\"\",1,0)+IF(Q29<>\"\",1,0)+IF(Q30<>\"\",1,0)+IF(Q31<>\"\",1,0)+IF(Q32<>\"\",1,0)+IF(Q33<>\"\",1,0)+IF(Q34<>\"\",1,0)","v":0},null,{"$f":"IF(S22<>\"\",1,0)+IF(S23<>\"\",1,0)+IF(S24<>\"\",1,0)+IF(S25<>\"\",1,0)+IF(S26<>\"\",1,0)+IF(S27<>\"\",1,0)+IF(S28<>\"\",1,0)+IF(S29<>\"\",1,0)+IF(S30<>\"\",1,0)+IF(S31<>\"\",1,0)+IF(S32<>\"\",1,0)+IF(S33<>\"\",1,0)+IF(S34<>\"\",1,0)","v":0},null,{"$f":"IF(U22<>\"\",1,0)+IF(U23<>\"\",1,0)+IF(U24<>\"\",1,0)+IF(U25<>\"\",1,0)+IF(U26<>\"\",1,0)+IF(U27<>\"\",1,0)+IF(U28<>\"\",1,0)+IF(U29<>\"\",1,0)+IF(U30<>\"\",1,0)+IF(U31<>\"\",1,0)+IF(U32<>\"\",1,0)+IF(U33<>\"\",1,0)+IF(U34<>\"\",1,0)","v":0},null,{"$f":"IF(W22<>\"\",1,0)+IF(W23<>\"\",1,0)+IF(W24<>\"\",1,0)+IF(W25<>\"\",1,0)+IF(W26<>\"\",1,0)+IF(W27<>\"\",1,0)+IF(W28<>\"\",1,0)+IF(W29<>\"\",1,0)+IF(W30<>\"\",1,0)+IF(W31<>\"\",1,0)+IF(W32<>\"\",1,0)+IF(W33<>\"\",1,0)+IF(W34<>\"\",1,0)","v":0},null,{"$f":"IF(Y22<>\"\",1,0)+IF(Y23<>\"\",1,0)+IF(Y24<>\"\",1,0)+IF(Y25<>\"\",1,0)+IF(Y26<>\"\",1,0)+IF(Y27<>\"\",1,0)+IF(Y28<>\"\",1,0)+IF(Y29<>\"\",1,0)+IF(Y30<>\"\",1,0)+IF(Y31<>\"\",1,0)+IF(Y32<>\"\",1,0)+IF(Y33<>\"\",1,0)+IF(Y34<>\"\",1,0)","v":0},null,{"$f":"IF(AA22<>\"\",1,0)+IF(AA23<>\"\",1,0)+IF(AA24<>\"\",1,0)+IF(AA25<>\"\",1,0)+IF(AA26<>\"\",1,0)+IF(AA27<>\"\",1,0)+IF(AA28<>\"\",1,0)+IF(AA29<>\"\",1,0)+IF(AA30<>\"\",1,0)+IF(AA31<>\"\",1,0)+IF(AA32<>\"\",1,0)+IF(AA33<>\"\",1,0)+IF(AA34<>\"\",1,0)","v":0}]